{"text_format":"1","workbook":"xlsx","n_sheets":12,"sheets":["Données générales ","Exercice à imprimer","Fiche A et B","Fiche C et D","Journal imprimable","Accès au corrigé","Corrigé A et B","Corrigé C et D ","Solutions","Un compte","Plan comptable","Fiches vides"],"not_rendered":{"charts":0,"images":0,"macros":1,"external_links":0,"defined_names":6,"comments":1,"pivot_tables":0},"unopened":[],"bounds":{"document_bytes":16777216,"sheet_cells":100000,"rows_first":2000,"rows_last":500,"rows_between":2000,"halvings":0,"cell_chars":16384,"cell_head_chars":4096},"cells_cut":0,"cells_raw":0,"read":"whole","date_system":"1900"}

{"sheet":"Données générales ","index":0,"n_rows":42,"n_cols":12,"rows_kept":42,"cut":false,"hidden":false,"merged":[[14,1,14,2],[15,1,15,2],[1,1,1,3],[18,2,18,3],[18,4,18,5],[2,5,2,7],[18,6,18,7],[33,2,33,8],[0,0,0,12],[13,1,13,2],[11,6,11,8],[13,4,13,5],[14,4,14,5],[3,4,3,5],[12,4,12,5],[3,6,3,7],[6,1,6,2],[10,1,10,2],[3,1,3,2],[4,1,4,2],[5,1,5,2],[15,4,15,5],[19,8,19,9],[19,4,19,5],[19,2,19,3],[21,4,21,5],[22,4,22,5],[19,6,19,7],[21,2,21,3],[22,2,22,3],[21,6,21,7],[22,6,22,7],[20,2,20,3],[20,4,20,5],[28,2,28,3],[25,4,25,5],[26,4,26,5],[27,4,27,5],[28,4,28,5],[26,2,26,3],[25,2,25,3],[21,8,21,9],[22,8,22,9],[23,8,23,9],[26,6,26,7],[27,2,27,3],[23,4,23,5],[24,4,24,5],[25,6,25,7],[23,2,23,3],[24,2,24,3],[34,2,34,11],[7,1,7,2],[8,1,8,2],[12,1,12,2],[24,8,24,9],[25,8,25,9],[26,8,26,9],[27,8,27,9],[23,6,23,7],[24,6,24,7],[18,8,18,9],[28,6,28,7],[28,8,28,9],[20,6,20,7],[20,8,20,9],[27,6,27,7]]}
["Décompte de salaire"]
[null,"Cellules blanches à compléter"]
[null,null,null,null,"Taux :",2016]
[null,"Charges sociales",null,"Total","Employeur",null,"Employé",null,null,null,true]
[null,"  ./. Caisse de pens.",null,{"$f":"SUM(E5+G5) & \" %\"","v":"18 %"},10,"%",8,"%",null,null,{"$f":"IF(K4=TRUE,E7+J7,E7)","v":5.3449999999999998}]
[null,"  ./. Ass acc non prof",null,{"$f":"SUM(E6+G6) & \" %\"","v":"1.86 %"},0.4,"%",1.46,"%",null,null,{"$f":"IF(K4=TRUE,G7+J7,G7)","v":5.1849999999999996}]
[null,"./. AVS/AI/APG",null,{"$f":"SUM(E7+G7) & \" %\"","v":"10.41 %"},{"$f":"5.125+0.16","v":5.2850000000000001},"%",5.125,"%","PC familles",0.06,null,"%"]
[null,{"$f":"\"./. AC1 jusqu'à un gain de \"&I8","v":"./. AC1 jusqu'à un gain de 12350"},null,{"$f":"SUM(E8+G8) & \" %\"","v":"2.2 %"},1.1000000000000001,"%",1.1000000000000001,"%",12350,"max"]
[null,"  ./. AC2 solidarité",null,{"$f":"SUM(E9+G9) & \" %\"","v":"1 %"},0.5,"%",0.5,"%",100000,"max",null," = illimité"]
[null,null,null,null,"enfant < 16 ans",null,"apprenti, étudidant",null,null,null,{"$f":"IF(K4=TRUE,\"./. AVS/AI/APG/PCfam\",\"./. AVS/AI/APG\")","v":"./. AVS/AI/APG/PCfam"}]
[null,"Allocation par enfant",null,null,200,null,300]
[null,null,null,"dès 3ème + 170.-"]
[null,"LPP",null,{"$f":"\"annuel \"&F3","v":"annuel 2016"},{"$f":"\"mensuel \"&F3","v":"mensuel 2016"},null,0,null,0]
[null,"Seuil d'entrée",null,21150,{"$f":"D14/12","v":1762.5},null,{"$f":"E14","v":1762.5},null,{"$f":"E15-E14","v":293.75}]
[null,"Salaire assuré  minimum",null,24675,{"$f":"D15/12","v":2056.25},null,{"$f":"E15+(E15-E14)","v":2350},null,{"$f":"G22","v":7200}]
{"$rows_left_out":28}
{"sheet":"Exercice à imprimer","index":1,"n_rows":51,"n_cols":19,"rows_kept":51,"cut":false,"hidden":false,"merged":[[1,0,1,18],[4,13,4,14],[4,15,4,17],[26,16,27,17],[26,14,26,15],[3,13,3,17],[4,8,4,9],[4,10,4,11],[6,13,6,14],[7,13,7,14],[27,14,27,15],[26,6,27,6],[26,1,27,5],[5,15,5,17],[10,13,10,14],[16,15,16,17],[5,13,5,14],[20,14,20,15],[47,9,47,11],[37,11,37,14],[26,7,27,8],[26,9,27,11],[28,9,28,11],[28,14,28,15],[30,9,30,11],[30,14,30,15],[26,12,26,13],[28,16,28,17],[29,1,29,5],[29,7,29,8],[29,9,29,11],[29,14,29,15],[29,16,29,17],[28,1,28,5],[28,7,28,8],[30,16,30,17],[31,1,31,5],[31,7,31,8],[31,9,31,11],[31,14,31,15],[31,16,31,17],[30,1,30,5],[30,7,30,8],[6,1,6,7],[7,1,7,7],[20,5,20,6],[11,13,12,17],[18,11,18,12],[17,15,17,17],[13,8,13,9],[14,8,14,9],[15,8,15,9],[17,11,17,12],[16,13,16,14],[8,13,8,14],[9,13,9,14]]}
[]
["Exercice sur les salaires"]
[]
[null,"Renseignements généraux",null,null,null,null,null,null,null,null,null,null,null,"Plan comptable",null,null,null,null,"soldes"]
[null,null,null,null,null,null,null,null,"employeur",null,"employé",null,null,1010,null,"Poste",null,null,60000]
[null,{"$f":"IF('Données générales '!K4=TRUE,\"AVS/AI/APG/PCfam\",\"AVS/AI/APG\")","v":"AVS/AI/APG/PCfam"},null,null,null,null,null,null,{"$f":"'Données générales '!K5","v":5.3449999999999998},"%",{"$f":"'Données générales '!K6","v":5.1849999999999996},"%",null,2170,null,"Dettes AVS",null,null,{"$f":"INT('Données générales '!K22*'Données générales '!D7*3/100) * 100*-1","v":-7900}]
[null,{"$f":"\"AC1 jusqu'à \"&'Données générales '!I8&\" CHF\"","v":"AC1 jusqu'à 12350 CHF"},null,null,null,null,null,null,{"$f":"'Données générales '!E8","v":1.1000000000000001},"%",{"$f":"'Données générales '!G8","v":1.1000000000000001},"%",null,2175,null,"Dettes LPP",null,null,{"$f":"INT('Données générales '!K22 *'Données générales '!D5*2.5/100)*100*-1","v":-11400}]
[null,{"$f":"\"AC2 solid. de \"&'Données générales '!I8&\" à \"&'Données générales '!I9","v":"AC2 solid. de 12350 à 100000"},null,null,null,null,null,null,{"$f":"'Données générales '!E9","v":0.5},"%",{"$f":"'Données générales '!G9","v":0.5},"%",null,2180,null,"Dettes AF*"]
[null,"Deuxième pilier (LPP)",null,null,null,null,null,null,{"$f":"'Données générales '!E5","v":10},"%",{"$f":"'Données générales '!G5","v":8},"%",null,5200,null,"Salaires"]
[null,"Assurance accident prof.",null,null,null,null,null,null,{"$f":"'Données générales '!E6","v":0.4},"%",null,null,null,5270,null,"Ch. sociales"]
[null,"Assurance accident non prof.",null,null,null,null,null,null,null,null,{"$f":"'Données générales '!G6","v":1.46},"%",null,6700,null,"ACS"]
[null,null,null,null,null,null,null,null,null,null,null,null,null,"* Caisse de compensation pour les allocations familiales."]
[null,"Information pour LPP"]
[null,"Salaire maximum assuré",null,null,null,null,null,null,{"$f":"'Données générales '!E16","v":7050},null,"mensuel"]
[null,"Déduction de coordination",null,null,null,null,null,null,{"$f":"'Données générales '!E15","v":2056.25},null,"mensuel"]
{"$rows_left_out":37}
{"sheet":"Fiche A et B","index":2,"n_rows":60,"n_cols":12,"rows_kept":60,"cut":false,"hidden":false,"merged":[[9,2,9,10],[22,4,22,8],[53,4,53,8],[54,4,54,8],[0,8,0,11],[3,3,3,6],[4,3,4,6],[13,2,13,10],[5,4,5,5],[15,4,15,5],[15,6,15,7],[19,11,20,11],[51,11,52,11],[17,11,18,11],[49,11,50,11],[32,8,32,11],[56,4,56,5],[36,3,36,6],[37,4,37,5],[56,6,56,7],[41,2,41,10],[45,2,45,10],[47,4,47,5],[47,6,47,7],[56,8,56,9],[35,3,35,6],[24,4,24,5],[24,6,24,7],[24,8,24,9],[21,4,21,8]]}
[null,"FICHE DE SALAIRE",null,null,null,null,"mois :",null,"Fiche A"]
[]
[]
[null,"Nom :",null,{"$f":"'Données générales '!C20","v":"Dupont Jean"}]
[null,"Avs no",null,null,null,null,null,null,"AVS o/n"]
[null,"Enfants < 16 ans",null,null,"16 - 25 ans",null,null,null,"LPP o/n"]
[]
[]
[null,null,"Décompte"]
[null,null,"Salaire déterminant AVS"]
[]
[null,null,"Allocations enfants"]
[]
[null,null,"Salaire brut"]
[]
{"$rows_left_out":46}
{"sheet":"Fiche C et D","index":3,"n_rows":60,"n_cols":12,"rows_kept":60,"cut":false,"hidden":false,"merged":[[56,4,56,5],[24,6,24,7],[24,8,24,9],[17,11,18,11],[49,11,50,11],[56,8,56,9],[53,4,53,8],[54,4,54,8],[21,4,21,8],[22,4,22,8],[32,8,32,11],[56,6,56,7],[0,8,0,11],[3,3,3,6],[4,3,4,6],[13,2,13,10],[5,4,5,5],[15,4,15,5],[15,6,15,7],[9,2,9,10],[19,11,20,11],[51,11,52,11],[36,3,36,6],[37,4,37,5],[41,2,41,10],[45,2,45,10],[47,4,47,5],[47,6,47,7],[24,4,24,5],[35,3,35,6]]}
[null,"FICHE DE SALAIRE",null,null,null,null,"mois :",null,"Fiche C"]
[]
[]
[null,"Nom :",null,{"$f":"'Données générales '!G20","v":"Bonzon Nathalie"}]
[null,"Avs no",null,null,null,null,null,null,"AVS o/n"]
[null,"Enfants < 16 ans",null,null,"16 - 25 ans",null,null,null,"LPP o/n"]
[]
[]
[null,null,"Décompte"]
[null,null,"Salaire déterminant AVS"]
[]
[null,null,"Allocations enfants"]
[]
[null,null,"Salaire brut"]
[]
{"$rows_left_out":46}
{"sheet":"Journal imprimable","index":4,"n_rows":67,"n_cols":9,"rows_kept":67,"cut":false,"hidden":false,"merged":[[3,1,4,1],[3,6,4,6],[3,7,3,8],[4,2,4,3],[4,4,4,5],[3,2,3,5]]}
[]
[]
[null,"Exercice sur les salaires",null,null,null,null,null,null,false]
[null,"No","Compte à",null,null,null,"Libellé","Sommes à"]
[null,null,"débiter",null,"créditer",null,null,"débiter","créditer"]
[null,null,1010,{"$f":"IF(C6>0,VLOOKUP(C6,'Plan comptable'!$B$2:$C$118,2),\"\")","v":"Poste"},9999,{"$f":"IF(E6>0,VLOOKUP(E6,'Plan comptable'!$B$2:$C$118,2),\"\")","v":"Contrepartie"},"Solde"]
[null,null,9999,{"$f":"IF(C7>0,VLOOKUP(C7,'Plan comptable'!$B$2:$C$118,2),\"\")","v":"Contrepartie"},2170,{"$f":"IF(E7>0,VLOOKUP(E7,'Plan comptable'!$B$2:$C$118,2),\"\")","v":"Dettes AVS / AC"},"Solde"]
[null,null,9999,{"$f":"IF(C8>0,VLOOKUP(C8,'Plan comptable'!$B$2:$C$118,2),\"\")","v":"Contrepartie"},2175,{"$f":"IF(E8>0,VLOOKUP(E8,'Plan comptable'!$B$2:$C$118,2),\"\")","v":"Dettes LPP"},"Solde"]
[null,null,null,{"$f":"IF(C9>0,VLOOKUP(C9,'Plan comptable'!$B$2:$C$118,2),\"\")","v":""},null,{"$f":"IF(E9>0,VLOOKUP(E9,'Plan comptable'!$B$2:$C$118,2),\"\")","v":""}]
[null,1,null,{"$f":"IF(C10>0,VLOOKUP(C10,'Plan comptable'!$B$2:$C$118,2),\"\")","v":""},null,{"$f":"IF(E10>0,VLOOKUP(E10,'Plan comptable'!$B$2:$C$118,2),\"\")","v":""}]
[null,null,null,{"$f":"IF(C11>0,VLOOKUP(C11,'Plan comptable'!$B$2:$C$118,2),\"\")","v":""},null,{"$f":"IF(E11>0,VLOOKUP(E11,'Plan comptable'!$B$2:$C$118,2),\"\")","v":""}]
[null,null,null,{"$f":"IF(C12>0,VLOOKUP(C12,'Plan comptable'!$B$2:$C$118,2),\"\")","v":""},null,{"$f":"IF(E12>0,VLOOKUP(E12,'Plan comptable'!$B$2:$C$118,2),\"\")","v":""}]
[null,null,null,{"$f":"IF(C13>0,VLOOKUP(C13,'Plan comptable'!$B$2:$C$118,2),\"\")","v":""},null,{"$f":"IF(E13>0,VLOOKUP(E13,'Plan comptable'!$B$2:$C$118,2),\"\")","v":""}]
[null,null,null,{"$f":"IF(C14>0,VLOOKUP(C14,'Plan comptable'!$B$2:$C$118,2),\"\")","v":""},null,{"$f":"IF(E14>0,VLOOKUP(E14,'Plan comptable'!$B$2:$C$118,2),\"\")","v":""}]
[null,null,null,{"$f":"IF(C15>0,VLOOKUP(C15,'Plan comptable'!$B$2:$C$118,2),\"\")","v":""},null,{"$f":"IF(E15>0,VLOOKUP(E15,'Plan comptable'!$B$2:$C$118,2),\"\")","v":""}]
{"$rows_left_out":53}
{"sheet":"Accès au corrigé","index":5,"n_rows":3,"n_cols":2,"rows_kept":3,"cut":false,"hidden":false,"merged":[[2,1,2,4]]}
[]
[]
[null,"Accès au corrigé de l'exercice"]

{"sheet":"Corrigé A et B","index":6,"n_rows":60,"n_cols":14,"rows_kept":60,"cut":false,"hidden":false,"merged":[[15,4,15,5],[15,6,15,7],[36,3,36,6],[37,4,37,5],[56,6,56,7],[41,2,41,10],[45,2,45,10],[47,4,47,5],[24,4,24,5],[24,6,24,7],[24,8,24,9],[21,4,21,8],[22,4,22,8],[35,3,35,6],[47,6,47,7],[0,8,0,11],[3,3,3,6],[4,3,4,6],[13,2,13,10],[5,4,5,5],[9,2,9,10],[17,12,20,12],[50,9,52,9],[32,8,32,11],[56,8,56,9],[53,4,53,8],[54,4,54,8],[17,11,20,11],[49,11,52,11],[18,9,20,9],[56,4,56,5]]}
[null,"FICHE DE SALAIRE",null,null,null,null,"mois :",null,"Corrigé fiche A"]
[]
[]
[null,"Nom :",null,{"$f":"'Données générales '!C20","v":"Dupont Jean"}]
[null,"Avs no",null,null,null,null,null,null,"AVS o/n",{"$f":"LEFT('Données générales '!C28,1)","v":"n"}]
[null,"Enfants < 16 ans",null,{"$f":"'Données générales '!C23","v":0},"16 - 25 ans",null,{"$f":"'Données générales '!C24","v":0},null,"LPP o/n",{"$f":"LEFT('Données générales '!C29,1)","v":"n"}]
[]
[]
[null,null,"Décompte"]
[null,null,"Salaire déterminant AVS",null,null,null,null,null,null,null,null,{"$f":"'Données générales '!C22","v":680}]
[]
[null,null,"Allocations enfants",null,null,null,null,null,null,null,null,{"$f":"(D6*'Données générales '!$E$11) + (G6 * 'Données générales '!$G$11)","v":0}]
[]
[null,null,"Salaire brut",null,null,null,null,null,null,null,null,{"$f":"L10+L12","v":680}]
[]
{"$rows_left_out":46}
{"sheet":"Corrigé C et D ","index":7,"n_rows":77,"n_cols":14,"rows_kept":77,"cut":false,"hidden":false,"merged":[[72,4,72,5],[75,4,75,5],[76,4,76,5],[36,3,36,6],[37,4,37,5],[56,6,56,7],[41,2,41,10],[45,2,45,10],[47,4,47,5],[47,6,47,7],[56,4,56,5],[73,4,73,5],[74,4,74,5],[56,8,56,9],[53,4,53,8],[54,4,54,8],[0,8,0,11],[3,3,3,6],[4,3,4,6],[13,2,13,10],[5,4,5,5],[9,2,9,10],[17,11,20,11],[49,11,52,11],[15,4,15,5],[15,6,15,7],[24,4,24,5],[24,6,24,7],[24,8,24,9],[22,4,22,8],[18,9,20,9],[50,9,52,9],[21,4,21,8],[32,8,32,11],[35,3,35,6]]}
[null,"FICHE DE SALAIRE",null,null,null,null,"mois :",null,"Corrigé fiche C"]
[]
[]
[null,"Nom :",null,{"$f":"'Données générales '!G20","v":"Bonzon Nathalie"}]
[null,"Avs no",null,null,null,null,null,null,"AVS o/n",{"$f":"LEFT('Données générales '!G28,1)","v":"o"}]
[null,"Enfants < 16 ans",null,{"$f":"'Données générales '!G23","v":2},"16 - 25 ans",null,{"$f":"'Données générales '!G24","v":1},null,"LPP o/n",{"$f":"LEFT('Données générales '!G29,1)","v":"o"}]
[]
[]
[null,null,"Décompte"]
[null,null,"Salaire déterminant AVS",null,null,null,null,null,null,null,null,{"$f":"'Données générales '!G22","v":7200}]
[]
[null,null,"Allocations enfants",null,null,null,null,null,null,null,null,{"$f":"(D6*'Données générales '!$E$11) + (G6 * 'Données générales '!$G$11)","v":700}]
[]
[null,null,"Salaire brut",null,null,null,null,null,null,null,null,{"$f":"L10+L12","v":7900}]
[]
{"$rows_left_out":63}
{"sheet":"Solutions","index":8,"n_rows":117,"n_cols":13,"rows_kept":117,"cut":false,"hidden":false,"merged":[[3,1,4,1],[3,6,4,6],[3,7,3,8],[4,2,4,3],[4,4,4,5],[3,2,3,5]]}
[null,null,null,null,null,null,null,null,false]
[]
[null,"Corrigé exercice sur les salaires",null,null,null,null,null,null,null,null,null,{"$f":"101-COUNTIF(L6:L117,\"\")","v":43}]
[null,"No","Compte à",null,null,null,"Libellé","Sommes à"]
[null,null,"débiter",null,"créditer",null,null,"débiter","créditer"]
[null,"Ouv",1010,{"$f":"IF(C6>0,VLOOKUP(C6,'Plan comptable'!$B$2:$C$118,2),\"\")","v":"Poste"},9999,{"$f":"IF(E6>0,VLOOKUP(E6,'Plan comptable'!$B$2:$C$118,2),\"\")","v":"Contrepartie"},"Solde à nouveau",{"$f":"'Exercice à imprimer'!S5","v":60000},null,{"$f":"IF($L6=\"\",\"\",IF(C6=\"\",\"\",LOOKUP(C6,Miniplan,'Plan comptable'!$A$2:$A$73)))","v":2},{"$f":"IF($L6=\"\",\"\",IF(E6=\"\",\"\",LOOKUP(E6,Miniplan,'Plan comptable'!$A$2:$A$73)))","v":63},{"$f":"IF(SUM(H6:I6)=0,\"\",IF(H6=\"\",I6,H6))","v":60000},{"$f":"L6","v":60000}]
[null,null,9999,{"$f":"IF(C7>0,VLOOKUP(C7,'Plan comptable'!$B$2:$C$118,2),\"\")","v":"Contrepartie"},2170,{"$f":"IF(E7>0,VLOOKUP(E7,'Plan comptable'!$B$2:$C$118,2),\"\")","v":"Dettes AVS / AC"},"Solde à nouveau",null,{"$f":"'Exercice à imprimer'!S6*-1","v":7900},{"$f":"IF($L7=\"\",\"\",IF(C7=\"\",\"\",LOOKUP(C7,Miniplan,'Plan comptable'!$A$2:$A$73)))","v":63},{"$f":"IF($L7=\"\",\"\",IF(E7=\"\",\"\",LOOKUP(E7,Miniplan,'Plan comptable'!$A$2:$A$73)))","v":20},7900,7900]
[null,null,9999,{"$f":"IF(C8>0,VLOOKUP(C8,'Plan comptable'!$B$2:$C$118,2),\"\")","v":"Contrepartie"},2175,{"$f":"IF(E8>0,VLOOKUP(E8,'Plan comptable'!$B$2:$C$118,2),\"\")","v":"Dettes LPP"},"Solde à nouveau",null,{"$f":"'Exercice à imprimer'!S7*-1","v":11400},{"$f":"IF($L8=\"\",\"\",IF(C8=\"\",\"\",LOOKUP(C8,Miniplan,'Plan comptable'!$A$2:$A$73)))","v":63},{"$f":"IF($L8=\"\",\"\",IF(E8=\"\",\"\",LOOKUP(E8,Miniplan,'Plan comptable'!$A$2:$A$73)))","v":21},11400,11400]
[null,null,null,{"$f":"IF(C9>0,VLOOKUP(C9,'Plan comptable'!$B$2:$C$118,2),\"\")","v":""},null,{"$f":"IF(E9>0,VLOOKUP(E9,'Plan comptable'!$B$2:$C$118,2),\"\")","v":""},null,null,0.1,{"$f":"IF($L9=\"\",\"\",IF(C9=\"\",\"\",LOOKUP(C9,Miniplan,'Plan comptable'!$A$2:$A$73)))","v":""},{"$f":"IF($L9=\"\",\"\",IF(E9=\"\",\"\",LOOKUP(E9,Miniplan,'Plan comptable'!$A$2:$A$73)))","v":""},0.1,0.1]
[null,1,5270,{"$f":"IF(C10>0,VLOOKUP(C10,'Plan comptable'!$B$2:$C$118,2),\"\")","v":"Charges sociales"},1010,{"$f":"IF(E10>0,VLOOKUP(E10,'Plan comptable'!$B$2:$C$118,2),\"\")","v":"Poste"},"Prime AA",{"$f":"'Exercice à imprimer'!L38*'Données générales '!D6","v":2843.5679999999998},{"$f":"H10","v":2843.5679999999998},{"$f":"IF($L10=\"\",\"\",IF(C10=\"\",\"\",LOOKUP(C10,Miniplan,'Plan comptable'!$A$2:$A$73)))","v":38},{"$f":"IF($L10=\"\",\"\",IF(E10=\"\",\"\",LOOKUP(E10,Miniplan,'Plan comptable'!$A$2:$A$73)))","v":2},2843.5679999999998,2843.5679999999998]
[null,null,null,{"$f":"IF(C11>0,VLOOKUP(C11,'Plan comptable'!$B$2:$C$118,2),\"\")","v":""},null,{"$f":"IF(E11>0,VLOOKUP(E11,'Plan comptable'!$B$2:$C$118,2),\"\")","v":""},null,null,0.1,{"$f":"IF($L11=\"\",\"\",IF(C11=\"\",\"\",LOOKUP(C11,Miniplan,'Plan comptable'!$A$2:$A$73)))","v":""},{"$f":"IF($L11=\"\",\"\",IF(E11=\"\",\"\",LOOKUP(E11,Miniplan,'Plan comptable'!$A$2:$A$73)))","v":""},0.1,0.1]
[null,"2A",5200,{"$f":"IF(C12>0,VLOOKUP(C12,'Plan comptable'!$B$2:$C$118,2),\"\")","v":"Salaires"},null,{"$f":"IF(E12>0,VLOOKUP(E12,'Plan comptable'!$B$2:$C$118,2),\"\")","v":""},{"$f":"\"Salaire brut \" &'Données générales '!C20","v":"Salaire brut Dupont Jean"},{"$f":"'Corrigé A et B'!L10","v":680},null,{"$f":"IF($L12=\"\",\"\",IF(C12=\"\",\"\",LOOKUP(C12,Miniplan,'Plan comptable'!$A$2:$A$73)))","v":37},{"$f":"IF($L12=\"\",\"\",IF(E12=\"\",\"\",LOOKUP(E12,Miniplan,'Plan comptable'!$A$2:$A$73)))","v":""},{"$f":"IF(SUM(H12:I12)=0,\"\",IF(H12=\"\",I12,H12))","v":680},{"$f":"L12","v":680}]
[null,null,2180,{"$f":"IF(C13>0,VLOOKUP(C13,'Plan comptable'!$B$2:$C$118,2),\"\")","v":"Dettes Caisse AF"},null,{"$f":"IF(E13>0,VLOOKUP(E13,'Plan comptable'!$B$2:$C$118,2),\"\")","v":""}," + Allocations familiales A",{"$f":"'Corrigé A et B'!L12","v":0},null,{"$f":"IF($L13=\"\",\"\",IF(C13=\"\",\"\",LOOKUP(C13,Miniplan,'Plan comptable'!$A$2:$A$73)))","v":""},{"$f":"IF($L13=\"\",\"\",IF(E13=\"\",\"\",LOOKUP(E13,Miniplan,'Plan comptable'!$A$2:$A$73)))","v":""},{"$f":"IF(SUM(H13:I13)=0,\"\",IF(H13=\"\",I13,H13))","v":""},{"$f":"L13","v":""}]
[null,null,5270,{"$f":"IF(C14>0,VLOOKUP(C14,'Plan comptable'!$B$2:$C$118,2),\"\")","v":"Charges sociales"},null,{"$f":"IF(E14>0,VLOOKUP(E14,'Plan comptable'!$B$2:$C$118,2),\"\")","v":""}," + Participation ass. maladie A",{"$f":"'Corrigé A et B'!L23","v":150},null,{"$f":"IF($L14=\"\",\"\",IF(C14=\"\",\"\",LOOKUP(C14,Miniplan,'Plan comptable'!$A$2:$A$73)))","v":38},{"$f":"IF($L14=\"\",\"\",IF(E14=\"\",\"\",LOOKUP(E14,Miniplan,'Plan comptable'!$A$2:$A$73)))","v":""},150,150]
[null,null,6700,{"$f":"IF(C15>0,VLOOKUP(C15,'Plan comptable'!$B$2:$C$118,2),\"\")","v":"ACE"},null,{"$f":"IF(E15>0,VLOOKUP(E15,'Plan comptable'!$B$2:$C$118,2),\"\")","v":""}," + Frais de déplacements A",{"$f":"'Corrigé A et B'!L26","v":0},null,{"$f":"IF($L15=\"\",\"\",IF(C15=\"\",\"\",LOOKUP(C15,Miniplan,'Plan comptable'!$A$2:$A$73)))","v":""},{"$f":"IF($L15=\"\",\"\",IF(E15=\"\",\"\",LOOKUP(E15,Miniplan,'Plan comptable'!$A$2:$A$73)))","v":""},"",""]
{"$rows_left_out":103}
{"sheet":"Un compte","index":9,"n_rows":100,"n_cols":36,"rows_kept":100,"cut":false,"hidden":false,"merged":[[5,1,5,7],[6,11,7,16],[6,2,6,3],[6,4,6,5],[6,26,7,29],[6,32,7,35],[8,26,8,27],[8,32,8,33],[8,28,8,29],[8,34,8,35]]}
[]
[]
[]
[]
[null,null,null,null,null,null,null,null,null,null,null,6,20,4,null,null,false]
[]
[null,null,null,null,null,null,null,null,null,null,null,{"$f":"VLOOKUP(M5,Plan,3)","v":"Dettes AVS / AC"},null,null,null,null,null,null,null,"Plan comptable",null,null,null,null,null,null,"Résultat",null,null,null,null,null,"Bilan"]
[null,null,null,null,null,null,null,null,{"$f":"IF($H8=\"\",\"\",LOOKUP(C8,$T$8:$T$26,$S$8:$S$26))","v":""},{"$f":"IF($H8=\"\",\"\",LOOKUP(E8,$T$8:$T$26,$S$8:$S$26))","v":""},null,null,null,null,null,null,null,null,{"$f":"'Plan comptable'!A2","v":1},{"$f":"'Plan comptable'!B2","v":1000},{"$f":"'Plan comptable'!C2","v":"Caisse"}]
[null,null,null,null,null,null,null,null,"","",null,"No","C/partie","Libellé","Débit","Crédit","Solde",null,{"$f":"'Plan comptable'!A3","v":2},{"$f":"'Plan comptable'!B3","v":1010},{"$f":"'Plan comptable'!C3","v":"Poste"},null,null,null,null,null,"Charges",null,"Produits",null,null,null,"Actif",null,"Passif"]
[null,null,null,null,null,null,null,null,"","",null,null,null,null,null,null,null,null,{"$f":"'Plan comptable'!A4","v":3},{"$f":"'Plan comptable'!B4","v":1020},{"$f":"'Plan comptable'!C4","v":"Banque"}]
[null,null,null,null,null,null,null,null,"","",null,null,9999,"Solde à nouveau",null,8000,-8000,null,{"$f":"'Plan comptable'!A5","v":4},{"$f":"'Plan comptable'!B5","v":1040},{"$f":"'Plan comptable'!C5","v":"Effets à recevoir"}]
[null,null,null,null,null,null,null,null,"","",null,null,null,"          - Retenue AVS / AC B",null,309.19,-8309.19,null,{"$f":"'Plan comptable'!A6","v":5},{"$f":"'Plan comptable'!B6","v":1060},{"$f":"'Plan comptable'!C6","v":"Titres"}]
[null,null,null,null,null,null,null,null,"","",null,null,null,"          - Retenue AVS / AC C",null,454.32,-8763.51,null,{"$f":"'Plan comptable'!A7","v":6},{"$f":"'Plan comptable'!B7","v":1100},{"$f":"'Plan comptable'!C7","v":"Créances clients"}]
[null,null,null,null,null,null,null,null,"","",null,null,null,"          - Retenue AVS / AC D",null,788.17,-9551.68,null,{"$f":"'Plan comptable'!A8","v":7},{"$f":"'Plan comptable'!B8","v":1108},{"$f":"'Plan comptable'!C8","v":"Créances douteuses"}]
[null,null,null,null,null,null,null,null,"","",null,null,null,"Part patronale AVS / 24800",null,1336.72,-10888.4,null,{"$f":"'Plan comptable'!A9","v":8},{"$f":"'Plan comptable'!B9","v":1109},{"$f":"'Plan comptable'!C9","v":"Provision s/créances"}]
{"$rows_left_out":86}
{"sheet":"Plan comptable","index":10,"n_rows":83,"n_cols":5,"rows_kept":83,"cut":false,"hidden":false,"merged":[]}
[null,"Zone \"Plan\"",null,null,"Choisir un compte"]
[1,1000,"Caisse",null,{"$f":"B2&\"  \"&C2","v":"1000  Caisse"}]
[{"$f":"A2+1","v":2},1010,"Poste",null,{"$f":"B3&\"  \"&C3","v":"1010  Poste"}]
[{"$f":"A3+1","v":3},1020,"Banque",null,"1020  Banque"]
[4,1040,"Effets à recevoir",null,"1040  Effets à recevoir"]
[5,1060,"Titres",null,"1060  Titres"]
[6,1100,"Créances clients",null,"1100  Créances clients"]
[7,1108,"Créances douteuses",null,"1108  Créances douteuses"]
[8,1109,"Provision s/créances",null,"1109  Provision s/créances"]
[9,1110,"Autres créances",null,"1110  Autres créances"]
[10,1200,"Stock marchandises",null,"1200  Stock marchandises"]
[11,1300,"Actifs transitoires",null,"1300  Actifs transitoires"]
[12,1500,"Machines",null,"1500  Machines"]
[13,1501,"Informatique",null,"1501  Informatique"]
[14,1510,"Mobilier",null,"1510  Mobilier"]
{"$rows_left_out":69}
{"sheet":"Fiches vides","index":11,"n_rows":60,"n_cols":12,"rows_kept":60,"cut":false,"hidden":false,"merged":[[56,4,56,5],[24,6,24,7],[24,8,24,9],[17,11,18,11],[49,11,50,11],[56,8,56,9],[53,4,53,8],[54,4,54,8],[21,4,21,8],[22,4,22,8],[32,8,32,11],[56,6,56,7],[0,8,0,11],[3,3,3,6],[4,3,4,6],[13,2,13,10],[5,4,5,5],[15,4,15,5],[15,6,15,7],[9,2,9,10],[19,11,20,11],[51,11,52,11],[36,3,36,6],[37,4,37,5],[41,2,41,10],[45,2,45,10],[47,4,47,5],[47,6,47,7],[24,4,24,5],[35,3,35,6]]}
[null,"FICHE DE SALAIRE",null,null,null,null,"mois :"]
[]
[]
[null,"Nom :"]
[null,"Avs no",null,null,null,null,null,null,"AVS o/n"]
[null,"Enfants < 16 ans",null,null,"16 - 25 ans",null,null,null,"LPP o/n"]
[]
[]
[null,null,"Décompte"]
[null,null,"Salaire déterminant AVS"]
[]
[null,null,"Allocations enfants"]
[]
[null,null,"Salaire brut"]
[]
{"$rows_left_out":45}