{"text_format":"1","workbook":"xlsx","n_sheets":2,"sheets":["Feuil1","Feuil2"],"not_rendered":{"charts":1,"images":55,"macros":1,"external_links":0,"defined_names":3,"comments":1,"pivot_tables":0},"unopened":[],"bounds":{"document_bytes":16777216,"sheet_cells":100000,"rows_first":2000,"rows_last":500,"rows_between":2000,"halvings":0,"cell_chars":16384,"cell_head_chars":4096},"cells_cut":0,"cells_raw":0,"read":"whole","date_system":"1900"}

{"sheet":"Feuil1","index":0,"n_rows":276,"n_cols":13,"rows_kept":276,"cut":false,"hidden":false,"merged":[[271,0,271,1],[272,0,272,1],[273,0,273,1],[274,0,274,1],[275,0,275,1],[266,0,266,1],[267,0,267,1],[268,0,268,1],[269,0,269,1],[270,0,270,1],[261,0,261,1],[262,0,262,1],[263,0,263,1],[264,0,264,1],[265,0,265,1],[256,0,256,1],[257,0,257,1],[258,0,258,1],[259,0,259,1],[260,0,260,1],[251,0,251,1],[252,0,252,1],[253,0,253,1],[254,0,254,1],[255,0,255,1],[246,0,246,1],[247,0,247,1],[248,0,248,1],[249,0,249,1],[250,0,250,1],[241,0,241,1],[242,0,242,1],[243,0,243,1],[244,0,244,1],[245,0,245,1],[236,0,236,1],[237,0,237,1],[238,0,238,1],[239,0,239,1],[240,0,240,1],[231,0,231,1],[232,0,232,1],[233,0,233,1],[234,0,234,1],[235,0,235,1],[226,0,226,1],[227,0,227,1],[228,0,228,1],[229,0,229,1],[230,0,230,1],[221,0,221,1],[222,0,222,1],[223,0,223,1],[224,0,224,1],[225,0,225,1],[216,0,216,1],[217,0,217,1],[218,0,218,1],[219,0,219,1],[220,0,220,1],[211,0,211,1],[212,0,212,1],[213,0,213,1],[214,0,214,1],[215,0,215,1],[206,0,206,1],[207,0,207,1],[208,0,208,1],[209,0,209,1],[210,0,210,1],[201,0,201,1],[202,0,202,1],[203,0,203,1],[204,0,204,1],[205,0,205,1],[196,0,196,1],[197,0,197,1],[198,0,198,1],[199,0,199,1],[200,0,200,1],[191,0,191,1],[192,0,192,1],[193,0,193,1],[194,0,194,1],[195,0,195,1],[186,0,186,1],[187,0,187,1],[188,0,188,1],[189,0,189,1],[190,0,190,1],[181,0,181,1],[182,0,182,1],[183,0,183,1],[184,0,184,1],[185,0,185,1],[176,0,176,1],[177,0,177,1],[178,0,178,1],[179,0,179,1],[180,0,180,1],[171,0,171,1],[172,0,172,1],[173,0,173,1],[174,0,174,1],[175,0,175,1],[166,0,166,1],[167,0,167,1],[168,0,168,1],[169,0,169,1],[170,0,170,1],[161,0,161,1],[162,0,162,1],[163,0,163,1],[164,0,164,1],[165,0,165,1],[156,0,156,1],[157,0,157,1],[158,0,158,1],[159,0,159,1],[160,0,160,1],[151,0,151,1],[152,0,152,1],[153,0,153,1],[154,0,154,1],[155,0,155,1],[146,0,146,1],[147,0,147,1],[148,0,148,1],[149,0,149,1],[150,0,150,1],[141,0,141,1],[142,0,142,1],[143,0,143,1],[144,0,144,1],[145,0,145,1],[136,0,136,1],[137,0,137,1],[138,0,138,1],[139,0,139,1],[140,0,140,1],[131,0,131,1],[132,0,132,1],[133,0,133,1],[134,0,134,1],[135,0,135,1],[126,0,126,1],[127,0,127,1],[128,0,128,1],[129,0,129,1],[130,0,130,1],[121,0,121,1],[122,0,122,1],[123,0,123,1],[124,0,124,1],[125,0,125,1],[116,0,116,1],[117,0,117,1],[118,0,118,1],[119,0,119,1],[120,0,120,1],[111,0,111,1],[112,0,112,1],[113,0,113,1],[114,0,114,1],[115,0,115,1],[106,0,106,1],[107,0,107,1],[108,0,108,1],[109,0,109,1],[110,0,110,1],[101,0,101,1],[102,0,102,1],[103,0,103,1],[104,0,104,1],[105,0,105,1],[96,0,96,1],[97,0,97,1],[98,0,98,1],[99,0,99,1],[100,0,100,1],[91,0,91,1],[92,0,92,1],[93,0,93,1],[94,0,94,1],[95,0,95,1],[86,0,86,1],[87,0,87,1],[88,0,88,1],[89,0,89,1],[90,0,90,1],[81,0,81,1],[82,0,82,1],[83,0,83,1],[84,0,84,1],[85,0,85,1],[76,0,76,1],[77,0,77,1],[78,0,78,1],[79,0,79,1],[80,0,80,1],[71,0,71,1],[72,0,72,1],[73,0,73,1],[74,0,74,1],[75,0,75,1],[66,0,66,1],[67,0,67,1],[68,0,68,1],[69,0,69,1],[70,0,70,1],[61,0,61,1],[62,0,62,1],[63,0,63,1],[64,0,64,1],[65,0,65,1],[56,0,56,1],[57,0,57,1],[58,0,58,1],[59,0,59,1],[60,0,60,1],[54,0,54,1],[55,0,55,1],[29,0,29,1],[47,0,47,1],[48,0,48,1],[49,0,49,1],[50,0,50,1],[51,0,51,1],[42,0,42,1],[43,0,43,1],[44,0,44,1],[45,0,45,1],[46,0,46,1],[37,0,37,1],[38,0,38,1],[39,0,39,1],[40,0,40,1],[41,0,41,1],[32,0,32,1],[33,0,33,1],[34,0,34,1],[35,0,35,1],[36,0,36,1],[46,3,46,5],[47,3,47,5],[2,0,2,1],[4,4,5,4],[11,5,11,6],[30,0,30,1],[31,0,31,1],[52,0,52,1],[53,0,53,1],[48,3,48,5],[49,3,49,5],[50,3,50,5],[51,3,51,5],[52,3,52,5],[53,3,53,5],[29,4,29,5],[54,3,54,5],[55,3,55,5],[56,3,56,5],[57,3,57,5],[58,3,58,5],[59,3,59,5],[60,3,60,5],[61,3,61,5],[62,3,62,5],[78,3,78,5],[79,3,79,5],[80,3,80,5],[63,3,63,5],[64,3,64,5],[65,3,65,5],[66,3,66,5],[67,3,67,5],[68,3,68,5],[69,3,69,5],[70,3,70,5],[71,3,71,5],[81,3,81,5],[82,3,82,5],[30,3,30,5],[31,3,31,5],[32,3,32,5],[33,3,33,5],[34,3,34,5],[35,3,35,5],[36,3,36,5],[37,3,37,5],[38,3,38,5],[39,3,39,5],[40,3,40,5],[41,3,41,5],[42,3,42,5],[43,3,43,5],[44,3,44,5],[45,3,45,5],[72,3,72,5],[73,3,73,5],[74,3,74,5],[75,3,75,5],[76,3,76,5],[77,3,77,5]]}
[null,null,"Tirage","Réponse","question","Total juste","%","test juste","rep données","rep juste","pourcentage","rep date","rep chef"]
[null,null,0,0,0,0,{"$f":"IF(K6=0,0,ROUND(G10/K6*100,0))","v":0},{"$f":"IF(K13=3,IF(D2=M2,1,0),IF(K13=4,IF(D2=L2,1,0),IF(C2=D2,1,0)))","v":1},0,0,100,{"$f":"VLOOKUP(C2,Data1,8)","v":{"$error":"#N/A"}},{"$f":"VLOOKUP(C2,Data2,6)","v":{"$error":"#N/A"}}]
["Blasons des cantons suisses",null,null,null,null,null,null,null,null,null,null,"Canton","Menu"]
[]
[null,null,null,null,{"$f":"IF(D2=0,\"8\",IF(H2=1,\"G\",\"H\"))","v":"8"}]
[null," Choix :",null,null,null,"Bonnes réponses :",{"$f":"G2&\" %\"","v":"0 %"},null,null,"plus grand de que ou rep",{"$f":"MAX(G7:G8)-L7","v":0}]
[null,null,null,null,null,"Nb questions :",{"$f":"E2","v":0},null,null,true,{"$f":"IF(J7=TRUE,27,53-G10)","v":27},{"$f":"IF(G7>=K7,1,0)","v":0},{"$f":"K7-G7","v":27}]
[null,null,null,null,null,"Nb réponses :",{"$f":"I2","v":0},{"$f":"IF(L9>=3,\"2 réponses maximum,\",\"\")","v":""},null,45383.760960648149]
[null,null,null,null,null,"Cantons tirés :",0,{"$f":"IF(L9>=3,\"cliquez sur Tirage !\",\"\")","v":""},null,45383.760567129626,"nb rép :",0]
[null,null,null,null,null,"Nb réponses justes : ",{"$f":"J2","v":0},"en h:m:s",{"$f":"J10","v":"00:00:00"},{"$f":"IF(J9>J8,J9-J8,0)","v":"00:00:00"}]
[]
[null,null,null,null,null,{"$f":"IF(M7<=1,\"Partie terminée - Bravo !\",\"\")","v":""}]
[null,null,null,null,null,null,null,null,null,"Choix :",1]
[null,null,null,"  ",null,null,null,null,null,"Français",1]
[null,null,null,null,null,null,null,null,null,"Allemand",2]
[null,null,null,null,null,null,null,null,null,"Chef-lieu",3]
[null,null,null,null,null,null,null,null,null,"Date d'entrée",4]
[null,null,null,null,null,null,null,null,null,"Abréviation",5]
[]
[]
[]
[]
[]
[]
[]
[]
[]
[]
[null,null,null,null,null,null,null,null,null,null,null,"Canton ou abr"]
["Réponse",null,"Résultat",null,"Ecusson",null,null,null,null,null,null,{"$f":"IF(K13>2,2,6)","v":6}]
[{"$f":"IF(J31=0,\"\",VLOOKUP(J31,Feuil2!$A$10:$F$35,$K$13+1))","v":""},null,{"$f":"IF(J31=0,\"\",IF(K31=1,\"v\",\"Pas trouvé\"))","v":""},{"$f":"IF(J31=0,\"\",VLOOKUP(J31,Data1,$L$30))","v":""},null,null,null,null,null,0,0]
[{"$f":"IF(J32=0,\"\",VLOOKUP(J32,Feuil2!$A$10:$F$35,$K$13+1))","v":""},null,{"$f":"IF(J32=0,\"\",IF(K32=1,\"v\",\"Pas trouvé\"))","v":""},"",null,null,null,null,null,0,0]
[{"$f":"IF(J33=0,\"\",VLOOKUP(J33,Feuil2!$A$10:$F$35,$K$13+1))","v":""},null,"","",null,null,null,null,null,0,0]
[{"$f":"IF(J34=0,\"\",VLOOKUP(J34,Feuil2!$A$10:$F$35,$K$13+1))","v":""},null,"","",null,null,null,null,null,0,0]
[{"$f":"IF(J35=0,\"\",VLOOKUP(J35,Feuil2!$A$10:$F$35,$K$13+1))","v":""},null,"","",null,null,null,null,null,0,0]
[{"$f":"IF(J36=0,\"\",VLOOKUP(J36,Feuil2!$A$10:$F$35,$K$13+1))","v":""},null,"","",null,null,null,null,null,0,0]
[{"$f":"IF(J37=0,\"\",VLOOKUP(J37,Feuil2!$A$10:$F$35,$K$13+1))","v":""},null,"","",null,null,null,null,null,0,0]
[{"$f":"IF(J38=0,\"\",VLOOKUP(J38,Feuil2!$A$10:$F$35,$K$13+1))","v":""},null,"","",null,null,null,null,null,0,0]
[{"$f":"IF(J39=0,\"\",VLOOKUP(J39,Feuil2!$A$10:$F$35,$K$13+1))","v":""},null,"","",null,null,null,null,null,0,0]
[{"$f":"IF(J40=0,\"\",VLOOKUP(J40,Feuil2!$A$10:$F$35,$K$13+1))","v":""},null,"","",null,null,null,null,null,0,0]
[{"$f":"IF(J41=0,\"\",VLOOKUP(J41,Feuil2!$A$10:$F$35,$K$13+1))","v":""},null,"","",null,null,null,null,null,0,0]
[{"$f":"IF(J42=0,\"\",VLOOKUP(J42,Feuil2!$A$10:$F$35,$K$13+1))","v":""},null,"","",null,null,null,null,null,0,0]
[{"$f":"IF(J43=0,\"\",VLOOKUP(J43,Feuil2!$A$10:$F$35,$K$13+1))","v":""},null,"","",null,null,null,null,null,0,0]
[{"$f":"IF(J44=0,\"\",VLOOKUP(J44,Feuil2!$A$10:$F$35,$K$13+1))","v":""},null,"","",null,null,null,null,null,0,0]
[{"$f":"IF(J45=0,\"\",VLOOKUP(J45,Feuil2!$A$10:$F$35,$K$13+1))","v":""},null,"","",null,null,null,null,null,0,0]
[{"$f":"IF(J46=0,\"\",VLOOKUP(J46,Feuil2!$A$10:$F$35,$K$13+1))","v":""},null,"","",null,null,null,null,null,0,0]
[{"$f":"IF(J47=0,\"\",VLOOKUP(J47,Feuil2!$A$10:$F$35,$K$13+1))","v":""},null,"","",null,null,null,null,null,0,0]
[{"$f":"IF(J48=0,\"\",VLOOKUP(J48,Feuil2!$A$10:$F$35,$K$13+1))","v":""},null,"","",null,null,null,null,null,0,0]
[{"$f":"IF(J49=0,\"\",VLOOKUP(J49,Feuil2!$A$10:$F$35,$K$13+1))","v":""},null,"","",null,null,null,null,null,0,0]
[{"$f":"IF(J50=0,\"\",VLOOKUP(J50,Feuil2!$A$10:$F$35,$K$13+1))","v":""},null,"","",null,null,null,null,null,0,0]
[{"$f":"IF(J51=0,\"\",VLOOKUP(J51,Feuil2!$A$10:$F$35,$K$13+1))","v":""},null,"","",null,null,null,null,null,0,0]
[{"$f":"IF(J52=0,\"\",VLOOKUP(J52,Feuil2!$A$10:$F$35,$K$13+1))","v":""},null,"","",null,null,null,null,null,0,0]
[{"$f":"IF(J53=0,\"\",VLOOKUP(J53,Feuil2!$A$10:$F$35,$K$13+1))","v":""},null,"","",null,null,null,null,null,0,0]
[{"$f":"IF(J54=0,\"\",VLOOKUP(J54,Feuil2!$A$10:$F$35,$K$13+1))","v":""},null,"","",null,null,null,null,null,0,0]
[{"$f":"IF(J55=0,\"\",VLOOKUP(J55,Feuil2!$A$10:$F$35,$K$13+1))","v":""},null,"","",null,null,null,null,null,0,0]
[{"$f":"IF(J56=0,\"\",VLOOKUP(J56,Feuil2!$A$10:$F$35,$K$13+1))","v":""},null,"","",null,null,null,null,null,0,0]
[{"$f":"IF(J57=0,\"\",VLOOKUP(J57,Feuil2!$A$10:$F$35,$K$13+1))","v":""},null,{"$f":"IF(J57=0,\"\",IF(K57=1,\"v\",\"Pas trouvé\"))","v":""},"",null,null,null,null,null,0,0]
[{"$f":"IF(J58=0,\"\",VLOOKUP(J58,Feuil2!$A$10:$F$35,$K$13+1))","v":""},null,"","",null,null,null,null,null,0,0]
[{"$f":"IF(J59=0,\"\",VLOOKUP(J59,Feuil2!$A$10:$F$35,$K$13+1))","v":""},null,"","",null,null,null,null,null,0,0]
[{"$f":"IF(J60=0,\"\",VLOOKUP(J60,Feuil2!$A$10:$F$35,$K$13+1))","v":""},null,"","",null,null,null,null,null,0,0]
[{"$f":"IF(J61=0,\"\",VLOOKUP(J61,Feuil2!$A$10:$F$35,$K$13+1))","v":""},null,"","",null,null,null,null,null,0,0]
[{"$f":"IF(J62=0,\"\",VLOOKUP(J62,Feuil2!$A$10:$F$35,$K$13+1))","v":""},null,"","",null,null,null,null,null,0,0]
[{"$f":"IF(J63=0,\"\",VLOOKUP(J63,Feuil2!$A$10:$F$35,$K$13+1))","v":""},null,"",{"$f":"IF(J63=0,\"\",VLOOKUP(J63,Data1,$L$30))","v":""},null,null,null,null,null,0,0]
[{"$f":"IF(J64=0,\"\",VLOOKUP(J64,Feuil2!$A$10:$F$35,$K$13+1))","v":""},null,"","",null,null,null,null,null,0,0]
[{"$f":"IF(J65=0,\"\",VLOOKUP(J65,Feuil2!$A$10:$F$35,$K$13+1))","v":""},null,"","",null,null,null,null,null,0,0]
[{"$f":"IF(J66=0,\"\",VLOOKUP(J66,Feuil2!$A$10:$F$35,$K$13+1))","v":""},null,"","",null,null,null,null,null,0,0]
[{"$f":"IF(J67=0,\"\",VLOOKUP(J67,Feuil2!$A$10:$F$35,$K$13+1))","v":""},null,"","",null,null,null,null,null,0,0]
[{"$f":"IF(J68=0,\"\",VLOOKUP(J68,Feuil2!$A$10:$F$35,$K$13+1))","v":""},null,"","",null,null,null,null,null,0,0]
[{"$f":"IF(J69=0,\"\",VLOOKUP(J69,Feuil2!$A$10:$F$35,$K$13+1))","v":""},null,"","",null,null,null,null,null,0,0]
[{"$f":"IF(J70=0,\"\",VLOOKUP(J70,Feuil2!$A$10:$F$35,$K$13+1))","v":""},null,"","",null,null,null,null,null,0,0]
[{"$f":"IF(J71=0,\"\",VLOOKUP(J71,Feuil2!$A$10:$F$35,$K$13+1))","v":""},null,"","",null,null,null,null,null,0,0]
[{"$f":"IF(J72=0,\"\",VLOOKUP(J72,Feuil2!$A$10:$F$35,$K$13+1))","v":""},null,"","",null,null,null,null,null,0,0]
[{"$f":"IF(J73=0,\"\",VLOOKUP(J73,Feuil2!$A$10:$F$35,$K$13+1))","v":""},null,"","",null,null,null,null,null,0,0]
[{"$f":"IF(J74=0,\"\",VLOOKUP(J74,Feuil2!$A$10:$F$35,$K$13+1))","v":""},null,"","",null,null,null,null,null,0,0]
[{"$f":"IF(J75=0,\"\",VLOOKUP(J75,Feuil2!$A$10:$F$35,$K$13+1))","v":""},null,"","",null,null,null,null,null,0,0]
[{"$f":"IF(J76=0,\"\",VLOOKUP(J76,Feuil2!$A$10:$F$35,$K$13+1))","v":""},null,"","",null,null,null,null,null,0,0]
[{"$f":"IF(J77=0,\"\",VLOOKUP(J77,Feuil2!$A$10:$F$35,$K$13+1))","v":""},null,"","",null,null,null,null,null,0,0]
[{"$f":"IF(J78=0,\"\",VLOOKUP(J78,Feuil2!$A$10:$F$35,$K$13+1))","v":""},null,"","",null,null,null,null,null,0,0]
[{"$f":"IF(J79=0,\"\",VLOOKUP(J79,Feuil2!$A$10:$F$35,$K$13+1))","v":""},null,"","",null,null,null,null,null,0,0]
[{"$f":"IF(J80=0,\"\",VLOOKUP(J80,Feuil2!$A$10:$F$35,$K$13+1))","v":""},null,"","",null,null,null,null,null,0,0]
[{"$f":"IF(J81=0,\"\",VLOOKUP(J81,Feuil2!$A$10:$F$35,$K$13+1))","v":""},null,"","",null,null,null,null,null,0,0]
[{"$f":"IF(J82=0,\"\",VLOOKUP(J82,Feuil2!$A$10:$F$35,$K$13+1))","v":""},null,"","",null,null,null,null,null,0,0]
[{"$f":"IF(J83=0,\"\",VLOOKUP(J83,Feuil2!$A$10:$F$35,$K$13+1))","v":""},null,{"$f":"IF(J83=0,\"\",IF(K83=1,\"v\",\"Pas trouvé\"))","v":""},"",null,null,null,null,null,0,0]
[{"$f":"IF(J84=0,\"\",VLOOKUP(J84,Feuil2!$A$10:$F$35,$K$13+1))","v":""},null,"",null,null,null,null,null,null,0,0]
[{"$f":"IF(J85=0,\"\",VLOOKUP(J85,Feuil2!$A$10:$F$35,$K$13+1))","v":""},null,"",null,null,null,null,null,null,0,0]
[{"$f":"IF(J86=0,\"\",VLOOKUP(J86,Feuil2!$A$10:$F$35,$K$13+1))","v":""},null,"",null,null,null,null,null,null,0,0]
[{"$f":"IF(J87=0,\"\",VLOOKUP(J87,Feuil2!$A$10:$F$35,$K$13+1))","v":""},null,"",null,null,null,null,null,null,0,0]
[{"$f":"IF(J88=0,\"\",VLOOKUP(J88,Feuil2!$A$10:$F$35,$K$13+1))","v":""},null,"",null,null,null,null,null,null,0,0]
[{"$f":"IF(J89=0,\"\",VLOOKUP(J89,Feuil2!$A$10:$F$35,$K$13+1))","v":""},null,"",null,null,null,null,null,null,0,0]
[{"$f":"IF(J90=0,\"\",VLOOKUP(J90,Feuil2!$A$10:$F$35,$K$13+1))","v":""},null,"",null,null,null,null,null,null,0,0]
[{"$f":"IF(J91=0,\"\",VLOOKUP(J91,Feuil2!$A$10:$F$35,$K$13+1))","v":""},null,"",null,null,null,null,null,null,0,0]
[{"$f":"IF(J92=0,\"\",VLOOKUP(J92,Feuil2!$A$10:$F$35,$K$13+1))","v":""},null,"",null,null,null,null,null,null,0,0]
[{"$f":"IF(J93=0,\"\",VLOOKUP(J93,Feuil2!$A$10:$F$35,$K$13+1))","v":""},null,"",null,null,null,null,null,null,0,0]
[{"$f":"IF(J94=0,\"\",VLOOKUP(J94,Feuil2!$A$10:$F$35,$K$13+1))","v":""},null,"",null,null,null,null,null,null,0,0]
[{"$f":"IF(J95=0,\"\",VLOOKUP(J95,Feuil2!$A$10:$F$35,$K$13+1))","v":""},null,"",null,null,null,null,null,null,0,0]
[{"$f":"IF(J96=0,\"\",VLOOKUP(J96,Feuil2!$A$10:$F$35,$K$13+1))","v":""},null,"",null,null,null,null,null,null,0,0]
[{"$f":"IF(J97=0,\"\",VLOOKUP(J97,Feuil2!$A$10:$F$35,$K$13+1))","v":""},null,"",null,null,null,null,null,null,0,0]
[{"$f":"IF(J98=0,\"\",VLOOKUP(J98,Feuil2!$A$10:$F$35,$K$13+1))","v":""},null,"",null,null,null,null,null,null,0,0]
[{"$f":"IF(J99=0,\"\",VLOOKUP(J99,Feuil2!$A$10:$F$35,$K$13+1))","v":""},null,"",null,null,null,null,null,null,0,0]
[{"$f":"IF(J100=0,\"\",VLOOKUP(J100,Feuil2!$A$10:$F$35,$K$13+1))","v":""},null,"",null,null,null,null,null,null,0,0]
[{"$f":"IF(J101=0,\"\",VLOOKUP(J101,Feuil2!$A$10:$F$35,$K$13+1))","v":""},null,"",null,null,null,null,null,null,0,0]
[{"$f":"IF(J102=0,\"\",VLOOKUP(J102,Feuil2!$A$10:$F$35,$K$13+1))","v":""},null,"",null,null,null,null,null,null,0,0]
[{"$f":"IF(J103=0,\"\",VLOOKUP(J103,Feuil2!$A$10:$F$35,$K$13+1))","v":""},null,"",null,null,null,null,null,null,0,0]
[{"$f":"IF(J104=0,\"\",VLOOKUP(J104,Feuil2!$A$10:$F$35,$K$13+1))","v":""},null,"",null,null,null,null,null,null,0,0]
[{"$f":"IF(J105=0,\"\",VLOOKUP(J105,Feuil2!$A$10:$F$35,$K$13+1))","v":""},null,"",null,null,null,null,null,null,0,0]
[{"$f":"IF(J106=0,\"\",VLOOKUP(J106,Feuil2!$A$10:$F$35,$K$13+1))","v":""},null,"",null,null,null,null,null,null,0,0]
[{"$f":"IF(J107=0,\"\",VLOOKUP(J107,Feuil2!$A$10:$F$35,$K$13+1))","v":""},null,"",null,null,null,null,null,null,0,0]
[{"$f":"IF(J108=0,\"\",VLOOKUP(J108,Feuil2!$A$10:$F$35,$K$13+1))","v":""},null,"",null,null,null,null,null,null,0,0]
[{"$f":"IF(J109=0,\"\",VLOOKUP(J109,Feuil2!$A$10:$F$35,$K$13+1))","v":""},null,"",null,null,null,null,null,null,0,0]
[{"$f":"IF(J110=0,\"\",VLOOKUP(J110,Feuil2!$A$10:$F$35,$K$13+1))","v":""},null,"",null,null,null,null,null,null,0,0]
[{"$f":"IF(J111=0,\"\",VLOOKUP(J111,Feuil2!$A$10:$F$35,$K$13+1))","v":""},null,"",null,null,null,null,null,null,0,0]
[{"$f":"IF(J112=0,\"\",VLOOKUP(J112,Feuil2!$A$10:$F$35,$K$13+1))","v":""},null,"",null,null,null,null,null,null,0,0]
[{"$f":"IF(J113=0,\"\",VLOOKUP(J113,Feuil2!$A$10:$F$35,$K$13+1))","v":""},null,"",null,null,null,null,null,null,0,0]
[{"$f":"IF(J114=0,\"\",VLOOKUP(J114,Feuil2!$A$10:$F$35,$K$13+1))","v":""},null,"",null,null,null,null,null,null,0,0]
[{"$f":"IF(J115=0,\"\",VLOOKUP(J115,Feuil2!$A$10:$F$35,$K$13+1))","v":""},null,"",null,null,null,null,null,null,0,0]
[{"$f":"IF(J116=0,\"\",VLOOKUP(J116,Feuil2!$A$10:$F$35,$K$13+1))","v":""},null,"",null,null,null,null,null,null,0,0]
[{"$f":"IF(J117=0,\"\",VLOOKUP(J117,Feuil2!$A$10:$F$35,$K$13+1))","v":""},null,"",null,null,null,null,null,null,0,0]
[{"$f":"IF(J118=0,\"\",VLOOKUP(J118,Feuil2!$A$10:$F$35,$K$13+1))","v":""},null,"",null,null,null,null,null,null,0,0]
[{"$f":"IF(J119=0,\"\",VLOOKUP(J119,Feuil2!$A$10:$F$35,$K$13+1))","v":""},null,"",null,null,null,null,null,null,0,0]
[{"$f":"IF(J120=0,\"\",VLOOKUP(J120,Feuil2!$A$10:$F$35,$K$13+1))","v":""},null,"",null,null,null,null,null,null,0,0]
{"$rows_left_out":157}
{"sheet":"Feuil2","index":1,"n_rows":78,"n_cols":28,"rows_kept":78,"cut":false,"hidden":false,"merged":[[7,7,8,7],[7,8,8,8]]}
[]
[]
[]
[null,null,"Argovie","Appenzel E.","Appenzel I.","Bâle C.","Bâle V.","Berne","Fribourg","Genève","Glaris","Grisons","Jura","Lucerne","Neuchatel","Nidwald","Obwald","Schaffouse","Schwitz","Soleure","St Gall","Tessin","Thurgovie","Uri","Valais","Vaud","Zoug","Zurich"]
[]
[]
[]
[null,null,null,null,null,null,"Menu :",{"$f":"Feuil1!$K$13+1","v":2},"Data2"]
[]
[1,"       Argovie","       Aargau","       Aarau",1803,"                          AG",{"$f":"IF($H$8=4,VLOOKUP(A10,Data2,$H$8),IF($H$8=5,VLOOKUP(A10,Data2,$H$8-3),VLOOKUP(A10,Data1,$H$8)))","v":"       Argovie"},{"$f":"VLOOKUP(E10,$J$10:$K$21,2)","v":9},1,1291,1,"       Aarau",1,{"$f":"VLOOKUP(D10,$L$10:$M$35,2)","v":1}]
[2,"       Appenzell Rhodes-Extérieures","       Appenzell Ausserrhoden","       Herisau",1513,"                          AR","       Appenzell Rhodes-Extérieures",8,2,1332,2,"       Altdorf",2,{"$f":"VLOOKUP(D11,$L$10:$M$35,2)","v":13}]
[3,"       Appenzell Rhodes-Intérieures","       Appenzell Innerrhoden","       Appenzell",1513,"                          AI","       Appenzell Rhodes-Intérieures",8,3,1351,3,"       Appenzell",3,3]
[4,"       Bâle-Campagne","       Basel-Landschaft","       Liestal",1501,"                          BL","       Bâle-Campagne",7,4,1352,4,"       Bâle",4,15]
[5,"       Bâle-Ville","       Basel-Stadt","       Bâle",1501,"                          BS","       Bâle-Ville",7,5,1353,5,"       Bellinzone",5,4]
[6,"       Berne","       Bern","       Berne",1353,"                          BE","       Berne",5,6,1481,6,"       Berne",6,6]
[7,"       Fribourg","       Freiburg","       Fribourg",1481,"                          FR","       Fribourg",6,7,1501,7,"       Coire",7,10]
[8,"       Genève","       Genf","       Genève",1815,"                          GE","       Genève",10,8,1513,8,"       Delémont",8,11]
[9,"       Glaris","       Glarus","       Glaris",1352,"                          GL","       Glaris",4,9,1803,9,"       Frauenfeld",9,12]
[10,"       Grisons","       Graubünden","       Coire",1803,"                          GR","       Grisons",9,10,1815,10,"       Fribourg",10,7]
[11,"       Jura","       Jura","       Delémont",1979,"                          JU","       Jura",11,11,1979,11,"       Genève",11,8]
[12,"       Lucerne","       Luzern","       Lucerne",1332,"                          LU","       Lucerne",2,12,"----------------------",12,"       Glaris",12,16]
[13,"       Neuchâtel","       Neuenburg","       Neuchâtel",1815,"                          NE","       Neuchâtel",10,13,"   ",13,"       Herisau",13,17]
[14,"       Nidwald","       Nidwalden","       Stans",1291,"                          NW","       Nidwald",1,14,"   ",14,"       Lausanne",14,24]
[15,"       Obwald","       Obwalden","       Sarnen",1291,"                          OW","       Obwald",1,15,"   ",15,"       Liestal",15,19]
[16,"       Schaffhouse","       Schaffhausen","       Schaffhouse",1501,"                          SH","       Schaffhouse",7,16,"   ",16,"       Lucerne",16,20]
[17,"       Schwytz","       Schwyz","       Schwytz",1291,"                          SZ","       Schwytz",1,17,"   ",17,"       Neuchâtel",17,21]
[18,"       Soleure","       Solothurn","       Soleure",1481,"                          SO","       Soleure",6,18,"   ",18,"       Saint-Gall",18,23]
[19,"       Saint-Gall","       St. Gallen","       Saint-Gall",1803,"                          SG","       Saint-Gall",9,19,"   ",19,"       Sarnen",19,18]
[20,"       Tessin","       Ticino","       Bellinzone",1803,"                          TI","       Tessin",9,20,"   ",20,"       Schaffhouse",20,5]
[21,"       Thurgovie","       Thurgau","       Frauenfeld",1803,"                          TG","       Thurgovie",9,21,"   ",21,"       Schwytz",21,9]
[22,"       Uri","       Uri","       Altdorf",1291,"                          UR","       Uri",1,22,"   ",22,"       Sion",22,2]
[23,"       Valais","       Wallis","       Sion",1815,"                          VS","       Valais",10,23,"   ",23,"       Soleure",23,22]
[24,"       Vaud","       Waadt","       Lausanne",1803,"                          VD","       Vaud",9,24,"   ",24,"       Stans",24,14]
[25,"       Zoug","       Zug","       Zoug",1352,"                          ZG","       Zoug",4,25,"   ",25,"       Zoug",25,25]
[26,"       Zurich","       Zürich","       Zurich",1351,"                          ZH","       Zurich",3,26,"   ",26,"       Zurich",26,26]
[]
[]
[" "]
[null,null,null,null,null,null,{"$f":"\"       \"&B39","v":"       "}]
[null,null,null,null,null,null,"       "]
[null,null,null,null,null,null,"       "]
[" "]
[]
[]
[]
[" "]
[]
[]
[]
[]
[" "]
[]
[]
[]
[" "]
[]
[]
[]
[" "]
[]
[]
[]
[]
[]
[]
[]
[]
[]
[]
[" "]
[]
[]
[]
[]
[]
[]
[]
[" "]