{"text_format":"1","workbook":"xlsx","n_sheets":3,"sheets":["Jeu","But","Liste"],"not_rendered":{"charts":0,"images":1,"macros":1,"external_links":0,"defined_names":1,"comments":0,"pivot_tables":0},"unopened":[],"bounds":{"document_bytes":16777216,"sheet_cells":100000,"rows_first":2000,"rows_last":500,"rows_between":2000,"halvings":0,"cell_chars":16384,"cell_head_chars":4096},"cells_cut":0,"cells_raw":0,"read":"whole","date_system":"1900"}

{"sheet":"Jeu","index":0,"n_rows":35,"n_cols":26,"rows_kept":35,"cut":false,"hidden":false,"merged":[[18,3,18,5],[18,8,18,10],[19,3,19,5],[16,3,16,5],[16,8,16,10],[17,3,17,5],[33,4,33,7],[20,3,20,5],[20,8,20,10],[21,3,21,5],[22,3,22,5],[22,8,22,10],[23,3,23,5],[33,10,33,11],[9,3,9,5],[1,1,1,10],[14,8,14,10],[15,3,15,5],[10,3,10,5],[10,8,10,10],[11,3,11,5],[12,3,12,5],[12,8,12,10],[13,3,13,5],[14,3,14,5],[9,8,9,12],[11,8,11,12],[13,8,13,12],[24,18,24,19],[23,8,23,12],[15,8,15,12],[17,8,17,12],[19,8,19,12],[21,8,21,12]]}
[null,null,null,null,null,null,null,null,null,null,null,null,null,"aaa","aaa","aaa","aaa"]
[null,null,null,null,null,null,null,null,null,null,null,null,null,"aaa","aaa","aaa","aaa"]
[null,null,null,null,null,null,null,null,null,null,null,null,null,"aaa","aaa","aaa","aaa"]
[null,"Série",1,{"$f":"VLOOKUP($C$4,Liste!$C$8:$X$200,4)","v":1},null,null,null,null,null,null,null,null,null,"aaa","aaa","aaa","aaa"]
[null,null,null,null,null,null,null,null,null,null,null,null,"Scores :",{"$f":"SUM(N8:N200)","v":0},{"$f":"SUM(O8:O200)","v":0},0,0]
[null,"Le mot cherché est un",null,null,{"$f":"VLOOKUP($C$4,Liste!$C$8:$X$200,3)","v":"verbe     "},"de",{"$f":"LEN(K6)","v":6},"lettres",{"$f":"IF(D28=2,LEFT(K6,1),IF(D28=3,LEFT(K6,2),\"\"))","v":""},null,{"$f":"VLOOKUP(C4,Liste!C8:V192,2)","v":"cacher"},null,null,"  Feuille de résultat"]
[null,null,null,null,null,null,null,null,"1ère lettre",null,null,null,null,"A","B","C","D"]
[]
[null,"Indice"]
[null,{"$f":"IF(D29<0,\"\",1)","v":1},null,{"$f":"IF(D29<0,\"\",VLOOKUP($C$4,Liste!$C$8:$Y$192,5))","v":"secret                        "},null,null,null,null,{"$f":"IF(D29<2,\"\",VLOOKUP($C$4,Liste!$C$8:$Y$200,13))","v":""}]
[]
[null,{"$f":"IF(D29<2,\"\",2)","v":""},null,{"$f":"IF(D29<2,\"\",VLOOKUP($C$4,Liste!$C$8:$Y$192,6))","v":""},null,null,null,null,{"$f":"IF(D29<3,\"\",VLOOKUP($C$4,Liste!$C$8:$Y$200,14))","v":""}]
[]
[null,{"$f":"IF(D29<3,\"\",3)","v":""},null,{"$f":"IF(D29<3,\"\",VLOOKUP($C$4,Liste!$C$8:$Y$192,7))","v":""},null,null,null,null,{"$f":"IF(D29<4,\"\",VLOOKUP($C$4,Liste!$C$8:$Y$200,15))","v":""}]
[]
[null,{"$f":"IF(D29<4,\"\",4)","v":""},null,{"$f":"IF(D29<4,\"\",VLOOKUP($C$4,Liste!$C$8:$Y$192,8))","v":""},null,null,null,null,{"$f":"IF(D29<5,\"\",VLOOKUP($C$4,Liste!$C$8:$Y$200,16))","v":""}]
[]
[null,{"$f":"IF(D29<5,\"\",5)","v":""},null,{"$f":"IF(D29<5,\"\",VLOOKUP($C$4,Liste!$C$8:$Y$192,9))","v":""},null,null,null,null,{"$f":"IF(D29<6,\"\",VLOOKUP($C$4,Liste!$C$8:$Y$200,17))","v":""}]
[]
[null,{"$f":"IF(D29<6,\"\",6)","v":""},null,{"$f":"IF(D29<6,\"\",VLOOKUP($C$4,Liste!$C$8:$Y$192,10))","v":""},null,null,null,null,{"$f":"IF(D29<7,\"\",VLOOKUP($C$4,Liste!$C$8:$Y$200,18))","v":""}]
{"$rows_left_out":16}
{"sheet":"But","index":1,"n_rows":40,"n_cols":8,"rows_kept":40,"cut":false,"hidden":false,"merged":[[3,1,5,1]]}
[]
[]
[]
[null,"Jeu des indices"]
[]
[]
[]
[]
[]
[]
[]
[]
[]
[]
[null,"Mots no",{"$f":"Jeu!C4","v":1}]
[]
[null,"Décompte de points pour le mot de ",{"$f":"Jeu!G6","v":6},"lettres"]
[]
[null,"Points au départ pour 10 lettres",{"$f":"Jeu!T26","v":12}]
[null," - Explications demandées",{"$f":"Jeu!T27","v":0}]
{"$rows_left_out":21}
{"sheet":"Liste","index":2,"n_rows":459,"n_cols":24,"rows_kept":459,"cut":false,"hidden":false,"merged":[[5,6,5,13],[5,14,5,21]]}
[null,null,"Jeu créé sur Smaky par Pierre Fornerod - Adaptation Excel par Y. Péguiron 15.12.01"]
[]
[]
[]
[]
[null,null,null,"Réponse",null,null,"Indices",null,null,null,null,null,null,null,"Explications"]
[null,null,null,null,null,null,1,2,3,4,5,6,7,8,1,2,3,4,5,6,7,8,null," "]
[null,null,1,"cacher","verbe     ",1,"secret                        ","couvrir                       ","ôter                          ","voiler                        ","dissimuler                 ","masquer                       ","                              ",null,".. en général on le cache                                                                           ","masquer                                                                    ","enlever de la vue                                            ","se voiler la face","taire, dissimuler                                                                                     ","se cacher le visage                                                                       ","                                                     ",null,"celer, voiler, enfouir, secret, mystère, se tapir, dissimuler, masquer, couvrir, ôter"," "]
[null,null,2,"clou","nom     ",1,"pointe                        ","tête                          ","sommet                        ","enfoncer                      ","pneu                       ","marteau                       ","                              ",null,"il est pointu                                                                                  ","partie du clou sur laquelle on tape                                         ","le clou du spectacle                                         ","enfoncer un clou","pneu à clous                                                                                        ","pour enfoncer les clous                                                                   ","                                                     ",null,"cheville, tête, corps, tige, pointe, boulon, crampon, fiche, marteau, enfoncer, taper, tenaille"," "]
[null,null,3,"bague","nom     ",1,"pierre                        ","alliance                      ","oiseaux                       ","écrin                         ","chevalière                 ","doigt                         ","                              ",null,"on orne les bagues de pierres précieuses                                                            ","bague de mariage, de fiançailles                                            ","on les bagues pour étudier leurs déplacements                ","boîte à bague !","bague épaisse                                                                                       ","la bague au doigt                                                                         ","                                                     ",null,"chevalière, pierre précieuse, écrin, annulaire, anneau, alliance"," "]
[null,null,4,"édifice","nom     ",1,"monument                      ","château                       ","villa                         ","maison                        ","bâtiment                   ","immeuble                      ","construction                  ",null,"Edifice commémoratif                                                                                ","Edifice historique                                                          ","édifice individuel                                           ","édifice courant","édifice                                                                                             ","édifice habitable                                                                         ","édifice                                              ",null,"bâtiment, monument, immeuble, maison, villa, manoir, donjon, habitation, église"," "]
[null,null,5,"erreur","nom     ",1,"impair                        ","coche                         ","leurre                        ","bourde                        ","quiproquo                  ","bévue                         ","gaffe                         ",null,"faute, maladresse                                                                                   ","et tac une coche!                                                           ","piège, appât                                                 ","bêtise","source de malentendu                                                                                ","erreur                                                                                    ","faute, erreur                                        ",null,"bourde, leurre, imagination, abus, impair, bévue, faute, méprise, aberration, quiproquo"," "]
[null,null,6,"briller","verbe     ",1,"feux                          ","luire                         ","étinceler                     ","rayonner                      ","scintiller                 ","                              ","                              ",null,"briller de mille feux                                                                               ","briller légèrement                                                          ","briller de manière intense                                   ","briller","briller avec un intensité variable                                                                  ","                                                                                          ","                                                     ",null,"chatoyer, miroiter, luire, étinceler, scintiller, éclairer, rayonner, illuminer"," "]
[null,null,7,"cartes","nom     ",1,"couleur                       ","talon                         ","carré                         ","battre                        ","banque                     ","carreau                       ","dame                          ",null,"un jeu de cartes a, en général 4 couleurs (trèfle, pique, carreau, coeur                            ","ce qui reste du jeu quand on a coupé ou distribué                           ","4 cartes de même valeur : carré d'as                         ","mélanger les cartes","au casino, on joue au 21 contre la banque                                                           ","une des 4 couleurs                                                                        ","valeur d'une carte (entre le valet et le roi)        ",null,"carreau, couleur, mise, dame, couper, donne, talon, banque, jouer, coeur, carré, tricheur, battre, déjeter, atout, trèfle, pique"," "]
[null,null,8,"concours","nom     ",1,"combat                        ","entrée                        ","circonstances                 ","compétition                   ","sélection                  ","examen                        ","jeu                           ",null,"concours à deux                                                                                     ","concours d'entrée (entreprise)                                              ","concours de circonstances, hasard                            ","concours à plusieurs","se mesurer à d'autres                                                                               ","test, concours                                                                            ","concours amical                                      ",null,"circonstances, lutte, joute, combat, rival, compétition, concurrent, champion, examen"," "]
[null,null,9,"bois","nom     ",1,"charme                        ","noyer                         ","langue                        ","plancher                      ","tavillon                   ","chêne                         ","arbre                         ",null,"espèce d'arbre                                                                                      ","arbre                                                                       ","la langue de bois ( parler pour ne rien dire)               ","il est en bois","sortes de petites tuiles en bois qui recouvrait les toits, les murs des chalets                     ","arbre dont le bois est utilisé pour faire des meubles                                     ","est fait de bois, par définition                     ",null,"charme, noyer, acajou, aulne, cèdre, frêne, santal, sapin, teck, érable, merisier, chêne"," "]
[null,null,10,"écriture","nom     ",1,"caractère                     ","dictée                        ","moine                         ","griffonner                    ","brouillon                  ","manuscrit                     ","lettre                        ",null,"signe typographique, hiéroglyphe                                                                    ","on écrit ce qu'on entend                                                    ","ils furent parmi les premiers à utiliser l'écriture          ","écrire quelques signes ou lettres","texte écrit rapidement, premier jet                                                                 ","texte écrit                                                                               ","...de l'alphabet ou message écrit que l'on envoie    ",null,"caractère, copie, dictée, manuscrit, lettre, marge, biffer, corriger, griffonner, ligne"," "]
[null,null,11,"administration","nom     ",1,"bureau                        ","fonctionnaire                 ","queue                         ","gouverner                     ","Etat                       ","gestion                       ","direction                     ",null,"Les employés de l'administration y travaillent                                                      ","Employé de l'administration                                                 ","Au guichet des bureaux de l'administration                   ","Administrer","Il administre ses citoyens                                                                          ","Action de gérer, d'administrer                                                            ","chef d'une administration                            ",null,"bureau, fonctionnaire, queue, rouages, régisseur, régir, gouverner, employé, Etat, gestion, direction"," "]
[null,null,12,"animal","nom     ",1,"Belmondo                      ","Etre                          ","sauvage                       ","bétail                        ","domestique                 ","                              ","                              ",null,"A joué dans \"L'animal\"                                                                              ","l'animal est un être vivant                                                 ","Animal sauvage, fauve                                        ","animaux de la ferme","animal domestique (chien...)                                                                        ","                                                                                          ","                                                     ",null,"bête, être vivant, créature, bestiole, bétail, faune, espèce, sauvage, domestique"," "]
[null,null,13,"bénéfice","nom     ",1,"avantage                      ","aubaine                       ","gagner                        ","profit                        ","rendement                  ","gratification                 ","intérêts                      ",null,"tirer bénéfice, avoir un avantage                                                                   ","chance, occasion favorable                                                  ","le bénéfice est un gain                                      ","syn. de bénéfice","permet de calculer le bénéfice                                                                      ","prime nette, en plus du salaire habituel                                                  ","Ce que l'épargne produit comme bénéfice              ",null,"avantage, rendement, aubaine, gratte, dividende, gagner, fructifier, gain, produit, profit"," "]
{"$rows_left_out":439}