{"text_format":"3","workbook":"xlsx","n_sheets":5,"sheets":["Pas à pas","Solutions","Un compte","Plan comptable","Journal imprimable"],"not_rendered":{"macros":1,"defined_names":5,"comments":1},"read":"whole","date_system":"1900"}

{"sheet":"Pas à pas","index":0,"n_rows":106,"n_cols":10,"rows_kept":106,"merged":[[3,1,4,1],[3,2,3,5],[3,6,4,6],[3,7,3,8],[4,2,4,3],[4,4,4,5]]}
[]
[]
[null,{"$f":"Solutions!B3","v":"Exercice : "},{"$nulls":5},100,false]
["v","No","Comptes à",{"$nulls":3},"Libellé","Sommes à"]
["v",null,"débiter",null,"créditer",null,null,"débiter","créditer",1]
[null,{"$f":"IF(Solutions!B6=\"\",\"\",Solutions!B6)","v":1},{"$f":"IF($A6=\"\",\"\",IF(Solutions!C6=\"\",\"\",Solutions!C6))","v":""},{"$f":"IF($A6=\"\",\"\",IF(Solutions!D6=\"\",\"\",Solutions!D6))","v":""},{"$f":"IF($A6=\"\",\"\",IF(Solutions!E6=\"\",\"\",Solutions!E6))","v":""},{"$f":"IF($A6=\"\",\"\",IF(Solutions!F6=\"\",\"\",Solutions!F6))","v":""},{"$f":"IF(A6=\"v\",Solutions!G6,IF($I$3=TRUE,Solutions!G6,\"\"))","v":""},{"$f":"IF($A6=\"\",\"\",IF(Solutions!H6=\"\",\"\",Solutions!H6))","v":""},{"$f":"IF($A6=\"\",\"\",IF(Solutions!I6=\"\",\"\",Solutions!I6))","v":""}]
[null,{"$f":"IF(Solutions!B7=\"\",\"\",Solutions!B7)","v":""},{"$f":"IF($A7=\"\",\"\",IF(Solutions!C7=\"\",\"\",Solutions!C7))","v":""},{"$f":"IF($A7=\"\",\"\",IF(Solutions!D7=\"\",\"\",Solutions!D7))","v":""},{"$f":"IF($A7=\"\",\"\",IF(Solutions!E7=\"\",\"\",Solutions!E7))","v":""},{"$f":"IF($A7=\"\",\"\",IF(Solutions!F7=\"\",\"\",Solutions!F7))","v":""},{"$f":"IF(A7=\"v\",Solutions!G7,IF($I$3=TRUE,Solutions!G7,\"\"))","v":""},{"$f":"IF($A7=\"\",\"\",IF(Solutions!H7=\"\",\"\",Solutions!H7))","v":""},{"$f":"IF($A7=\"\",\"\",IF(Solutions!I7=\"\",\"\",Solutions!I7))","v":""}]
[null,{"$f":"IF(Solutions!B8=\"\",\"\",Solutions!B8)","v":""},{"$f":"IF($A8=\"\",\"\",IF(Solutions!C8=\"\",\"\",Solutions!C8))","v":""},{"$f":"IF($A8=\"\",\"\",IF(Solutions!D8=\"\",\"\",Solutions!D8))","v":""},{"$f":"IF($A8=\"\",\"\",IF(Solutions!E8=\"\",\"\",Solutions!E8))","v":""},{"$f":"IF($A8=\"\",\"\",IF(Solutions!F8=\"\",\"\",Solutions!F8))","v":""},{"$f":"IF(A8=\"v\",Solutions!G8,IF($I$3=TRUE,IF(A6=\"v\",Solutions!G8,\"\"),\"\"))","v":""},{"$f":"IF($A8=\"\",\"\",IF(Solutions!H8=\"\",\"\",Solutions!H8))","v":""},{"$f":"IF($A8=\"\",\"\",IF(Solutions!I8=\"\",\"\",Solutions!I8))","v":""}]
[null,{"$f":"IF(Solutions!B9=\"\",\"\",Solutions!B9)","v":""},{"$f":"IF($A9=\"\",\"\",IF(Solutions!C9=\"\",\"\",Solutions!C9))","v":""},{"$f":"IF($A9=\"\",\"\",IF(Solutions!D9=\"\",\"\",Solutions!D9))","v":""},{"$f":"IF($A9=\"\",\"\",IF(Solutions!E9=\"\",\"\",Solutions!E9))","v":""},{"$f":"IF($A9=\"\",\"\",IF(Solutions!F9=\"\",\"\",Solutions!F9))","v":""},{"$f":"IF(A9=\"v\",Solutions!G9,IF($I$3=TRUE,IF(A7=\"v\",Solutions!G9,\"\"),\"\"))","v":""},{"$f":"IF($A9=\"\",\"\",IF(Solutions!H9=\"\",\"\",Solutions!H9))","v":""},{"$f":"IF($A9=\"\",\"\",IF(Solutions!I9=\"\",\"\",Solutions!I9))","v":""}]
[null,{"$f":"IF(Solutions!B10=\"\",\"\",Solutions!B10)","v":""},{"$f":"IF($A10=\"\",\"\",IF(Solutions!C10=\"\",\"\",Solutions!C10))","v":""},{"$f":"IF($A10=\"\",\"\",IF(Solutions!D10=\"\",\"\",Solutions!D10))","v":""},{"$f":"IF($A10=\"\",\"\",IF(Solutions!E10=\"\",\"\",Solutions!E10))","v":""},{"$f":"IF($A10=\"\",\"\",IF(Solutions!F10=\"\",\"\",Solutions!F10))","v":""},{"$f":"IF(A10=\"v\",Solutions!G10,IF($I$3=TRUE,IF(A8=\"v\",Solutions!G10,\"\"),\"\"))","v":""},{"$f":"IF($A10=\"\",\"\",IF(Solutions!H10=\"\",\"\",Solutions!H10))","v":""},{"$f":"IF($A10=\"\",\"\",IF(Solutions!I10=\"\",\"\",Solutions!I10))","v":""}]
[null,{"$f":"IF(Solutions!B11=\"\",\"\",Solutions!B11)","v":""},{"$f":"IF($A11=\"\",\"\",IF(Solutions!C11=\"\",\"\",Solutions!C11))","v":""},{"$f":"IF($A11=\"\",\"\",IF(Solutions!D11=\"\",\"\",Solutions!D11))","v":""},{"$f":"IF($A11=\"\",\"\",IF(Solutions!E11=\"\",\"\",Solutions!E11))","v":""},{"$f":"IF($A11=\"\",\"\",IF(Solutions!F11=\"\",\"\",Solutions!F11))","v":""},{"$f":"IF(A11=\"v\",Solutions!G11,IF($I$3=TRUE,IF(A9=\"v\",Solutions!G11,\"\"),\"\"))","v":""},{"$f":"IF($A11=\"\",\"\",IF(Solutions!H11=\"\",\"\",Solutions!H11))","v":""},{"$f":"IF($A11=\"\",\"\",IF(Solutions!I11=\"\",\"\",Solutions!I11))","v":""}]
[null,{"$f":"IF(Solutions!B12=\"\",\"\",Solutions!B12)","v":""},{"$f":"IF($A12=\"\",\"\",IF(Solutions!C12=\"\",\"\",Solutions!C12))","v":""},{"$f":"IF($A12=\"\",\"\",IF(Solutions!D12=\"\",\"\",Solutions!D12))","v":""},{"$f":"IF($A12=\"\",\"\",IF(Solutions!E12=\"\",\"\",Solutions!E12))","v":""},{"$f":"IF($A12=\"\",\"\",IF(Solutions!F12=\"\",\"\",Solutions!F12))","v":""},{"$f":"IF(A12=\"v\",Solutions!G12,IF($I$3=TRUE,IF(A10=\"v\",Solutions!G12,\"\"),\"\"))","v":""},{"$f":"IF($A12=\"\",\"\",IF(Solutions!H12=\"\",\"\",Solutions!H12))","v":""},{"$f":"IF($A12=\"\",\"\",IF(Solutions!I12=\"\",\"\",Solutions!I12))","v":""}]
[null,{"$f":"IF(Solutions!B13=\"\",\"\",Solutions!B13)","v":""},{"$f":"IF($A13=\"\",\"\",IF(Solutions!C13=\"\",\"\",Solutions!C13))","v":""},{"$f":"IF($A13=\"\",\"\",IF(Solutions!D13=\"\",\"\",Solutions!D13))","v":""},{"$f":"IF($A13=\"\",\"\",IF(Solutions!E13=\"\",\"\",Solutions!E13))","v":""},{"$f":"IF($A13=\"\",\"\",IF(Solutions!F13=\"\",\"\",Solutions!F13))","v":""},{"$f":"IF(A13=\"v\",Solutions!G13,IF($I$3=TRUE,IF(A11=\"v\",Solutions!G13,\"\"),\"\"))","v":""},{"$f":"IF($A13=\"\",\"\",IF(Solutions!H13=\"\",\"\",Solutions!H13))","v":""},{"$f":"IF($A13=\"\",\"\",IF(Solutions!I13=\"\",\"\",Solutions!I13))","v":""}]
[null,{"$f":"IF(Solutions!B14=\"\",\"\",Solutions!B14)","v":""},{"$f":"IF($A14=\"\",\"\",IF(Solutions!C14=\"\",\"\",Solutions!C14))","v":""},{"$f":"IF($A14=\"\",\"\",IF(Solutions!D14=\"\",\"\",Solutions!D14))","v":""},{"$f":"IF($A14=\"\",\"\",IF(Solutions!E14=\"\",\"\",Solutions!E14))","v":""},{"$f":"IF($A14=\"\",\"\",IF(Solutions!F14=\"\",\"\",Solutions!F14))","v":""},{"$f":"IF(A14=\"v\",Solutions!G14,IF($I$3=TRUE,IF(A12=\"v\",Solutions!G14,\"\"),\"\"))","v":""},{"$f":"IF($A14=\"\",\"\",IF(Solutions!H14=\"\",\"\",Solutions!H14))","v":""},{"$f":"IF($A14=\"\",\"\",IF(Solutions!I14=\"\",\"\",Solutions!I14))","v":""}]
[null,{"$f":"IF(Solutions!B15=\"\",\"\",Solutions!B15)","v":""},{"$f":"IF($A15=\"\",\"\",IF(Solutions!C15=\"\",\"\",Solutions!C15))","v":""},{"$f":"IF($A15=\"\",\"\",IF(Solutions!D15=\"\",\"\",Solutions!D15))","v":""},{"$f":"IF($A15=\"\",\"\",IF(Solutions!E15=\"\",\"\",Solutions!E15))","v":""},{"$f":"IF($A15=\"\",\"\",IF(Solutions!F15=\"\",\"\",Solutions!F15))","v":""},{"$f":"IF(A15=\"v\",Solutions!G15,IF($I$3=TRUE,IF(A13=\"v\",Solutions!G15,\"\"),\"\"))","v":""},{"$f":"IF($A15=\"\",\"\",IF(Solutions!H15=\"\",\"\",Solutions!H15))","v":""},{"$f":"IF($A15=\"\",\"\",IF(Solutions!I15=\"\",\"\",Solutions!I15))","v":""}]
[null,{"$f":"IF(Solutions!B16=\"\",\"\",Solutions!B16)","v":""},{"$f":"IF($A16=\"\",\"\",IF(Solutions!C16=\"\",\"\",Solutions!C16))","v":""},{"$f":"IF($A16=\"\",\"\",IF(Solutions!D16=\"\",\"\",Solutions!D16))","v":""},{"$f":"IF($A16=\"\",\"\",IF(Solutions!E16=\"\",\"\",Solutions!E16))","v":""},{"$f":"IF($A16=\"\",\"\",IF(Solutions!F16=\"\",\"\",Solutions!F16))","v":""},{"$f":"IF(A16=\"v\",Solutions!G16,IF($I$3=TRUE,IF(A14=\"v\",Solutions!G16,\"\"),\"\"))","v":""},{"$f":"IF($A16=\"\",\"\",IF(Solutions!H16=\"\",\"\",Solutions!H16))","v":""},{"$f":"IF($A16=\"\",\"\",IF(Solutions!I16=\"\",\"\",Solutions!I16))","v":""}]
[null,{"$f":"IF(Solutions!B17=\"\",\"\",Solutions!B17)","v":""},{"$f":"IF($A17=\"\",\"\",IF(Solutions!C17=\"\",\"\",Solutions!C17))","v":""},{"$f":"IF($A17=\"\",\"\",IF(Solutions!D17=\"\",\"\",Solutions!D17))","v":""},{"$f":"IF($A17=\"\",\"\",IF(Solutions!E17=\"\",\"\",Solutions!E17))","v":""},{"$f":"IF($A17=\"\",\"\",IF(Solutions!F17=\"\",\"\",Solutions!F17))","v":""},{"$f":"IF(A17=\"v\",Solutions!G17,IF($I$3=TRUE,IF(A15=\"v\",Solutions!G17,\"\"),\"\"))","v":""},{"$f":"IF($A17=\"\",\"\",IF(Solutions!H17=\"\",\"\",Solutions!H17))","v":""},{"$f":"IF($A17=\"\",\"\",IF(Solutions!I17=\"\",\"\",Solutions!I17))","v":""}]
[null,{"$f":"IF(Solutions!B18=\"\",\"\",Solutions!B18)","v":""},{"$f":"IF($A18=\"\",\"\",IF(Solutions!C18=\"\",\"\",Solutions!C18))","v":""},{"$f":"IF($A18=\"\",\"\",IF(Solutions!D18=\"\",\"\",Solutions!D18))","v":""},{"$f":"IF($A18=\"\",\"\",IF(Solutions!E18=\"\",\"\",Solutions!E18))","v":""},{"$f":"IF($A18=\"\",\"\",IF(Solutions!F18=\"\",\"\",Solutions!F18))","v":""},{"$f":"IF(A18=\"v\",Solutions!G18,IF($I$3=TRUE,IF(A16=\"v\",Solutions!G18,\"\"),\"\"))","v":""},{"$f":"IF($A18=\"\",\"\",IF(Solutions!H18=\"\",\"\",Solutions!H18))","v":""},{"$f":"IF($A18=\"\",\"\",IF(Solutions!I18=\"\",\"\",Solutions!I18))","v":""}]
[null,{"$f":"IF(Solutions!B19=\"\",\"\",Solutions!B19)","v":""},{"$f":"IF($A19=\"\",\"\",IF(Solutions!C19=\"\",\"\",Solutions!C19))","v":""},{"$f":"IF($A19=\"\",\"\",IF(Solutions!D19=\"\",\"\",Solutions!D19))","v":""},{"$f":"IF($A19=\"\",\"\",IF(Solutions!E19=\"\",\"\",Solutions!E19))","v":""},{"$f":"IF($A19=\"\",\"\",IF(Solutions!F19=\"\",\"\",Solutions!F19))","v":""},{"$f":"IF(A19=\"v\",Solutions!G19,IF($I$3=TRUE,IF(A17=\"v\",Solutions!G19,\"\"),\"\"))","v":""},{"$f":"IF($A19=\"\",\"\",IF(Solutions!H19=\"\",\"\",Solutions!H19))","v":""},{"$f":"IF($A19=\"\",\"\",IF(Solutions!I19=\"\",\"\",Solutions!I19))","v":""}]
[null,{"$f":"IF(Solutions!B20=\"\",\"\",Solutions!B20)","v":""},{"$f":"IF($A20=\"\",\"\",IF(Solutions!C20=\"\",\"\",Solutions!C20))","v":""},{"$f":"IF($A20=\"\",\"\",IF(Solutions!D20=\"\",\"\",Solutions!D20))","v":""},{"$f":"IF($A20=\"\",\"\",IF(Solutions!E20=\"\",\"\",Solutions!E20))","v":""},{"$f":"IF($A20=\"\",\"\",IF(Solutions!F20=\"\",\"\",Solutions!F20))","v":""},{"$f":"IF(A20=\"v\",Solutions!G20,IF($I$3=TRUE,IF(A18=\"v\",Solutions!G20,\"\"),\"\"))","v":""},{"$f":"IF($A20=\"\",\"\",IF(Solutions!H20=\"\",\"\",Solutions!H20))","v":""},{"$f":"IF($A20=\"\",\"\",IF(Solutions!I20=\"\",\"\",Solutions!I20))","v":""}]
{"$rows_left_out":87}
{"sheet":"Solutions","index":1,"n_rows":106,"n_cols":15,"rows_kept":106,"merged":[[3,1,4,1],[3,2,3,5],[3,6,4,6],[3,7,3,8],[4,2,4,3],[4,4,4,5]]}
[null,null,{"$f":"IF(SUM(H6:I6)=0,\"Saisie semi-automatique des comptes : \",\"\")","v":"Saisie semi-automatique des comptes : "}]
[null,null,{"$f":"IF(SUM(H6:I6)=0,\"Entrer le no du compte dans la colonne ad'hoc (C ou E), au clavier ou avec le formulaire (Plan comptable) accessible par un clic sur la bande grise tout à gauche.\",\"\")","v":"Entrer le no du compte dans la colonne ad'hoc (C ou E), au clavier ou avec le formulaire (Plan comptable) accessible par un clic sur la bande grise tout à gauche."},{"$nulls":5},2,{"$nulls":5},"lignes/masque"]
[null,"Exercice : ",{"$nulls":6},120,null,null,{"$f":"101-COUNTIF(L6:L106,\"\")","v":0}]
[null,"No","Comptes à",{"$nulls":3},"Libellé","Sommes à"]
[null,null,"débiter",null,"créditer",null,null,"débiter","créditer"]
[null,1,null,{"$f":"IF(C6>0,VLOOKUP(C6,'Plan comptable'!$B$2:$C$123,2),\"\")","v":""},null,{"$f":"IF(E6>0,VLOOKUP(E6,'Plan comptable'!$B$2:$C$123,2),\"\")","v":""},null,null,{"$f":"H6","v":{"v":0,"d":"0.00"}},{"$f":"IF($L6=\"\",\"\",IF(C6=\"\",\"\",LOOKUP(C6,Miniplan,'Plan comptable'!$A$2:$A$78)))","v":""},{"$f":"IF($L6=\"\",\"\",IF(E6=\"\",\"\",LOOKUP(E6,Miniplan,'Plan comptable'!$A$2:$A$78)))","v":""},{"$f":"IF(SUM(H6:I6)=0,\"\",IF(H6=\"\",I6,H6))","v":""}]
[{"$nulls":3},{"$f":"IF(C7>0,VLOOKUP(C7,'Plan comptable'!$B$2:$C$123,2),\"\")","v":""},null,{"$f":"IF(E7>0,VLOOKUP(E7,'Plan comptable'!$B$2:$C$123,2),\"\")","v":""},null,null,{"$f":"H7","v":{"v":0,"d":"0.00"}},{"$f":"IF($L7=\"\",\"\",IF(C7=\"\",\"\",LOOKUP(C7,Miniplan,'Plan comptable'!$A$2:$A$78)))","v":""},{"$f":"IF($L7=\"\",\"\",IF(E7=\"\",\"\",LOOKUP(E7,Miniplan,'Plan comptable'!$A$2:$A$78)))","v":""},{"$f":"IF(SUM(H7:I7)=0,\"\",IF(H7=\"\",I7,H7))","v":""}]
[{"$nulls":3},{"$f":"IF(C8>0,VLOOKUP(C8,'Plan comptable'!$B$2:$C$123,2),\"\")","v":""},null,{"$f":"IF(E8>0,VLOOKUP(E8,'Plan comptable'!$B$2:$C$123,2),\"\")","v":""},null,null,{"v":0,"d":"0.00"},{"$f":"IF($L8=\"\",\"\",IF(C8=\"\",\"\",LOOKUP(C8,Miniplan,'Plan comptable'!$A$2:$A$78)))","v":""},{"$f":"IF($L8=\"\",\"\",IF(E8=\"\",\"\",LOOKUP(E8,Miniplan,'Plan comptable'!$A$2:$A$78)))","v":""},""]
[{"$nulls":3},{"$f":"IF(C9>0,VLOOKUP(C9,'Plan comptable'!$B$2:$C$123,2),\"\")","v":""},null,{"$f":"IF(E9>0,VLOOKUP(E9,'Plan comptable'!$B$2:$C$123,2),\"\")","v":""},null,null,{"v":0,"d":"0.00"},{"$f":"IF($L9=\"\",\"\",IF(C9=\"\",\"\",LOOKUP(C9,Miniplan,'Plan comptable'!$A$2:$A$78)))","v":""},{"$f":"IF($L9=\"\",\"\",IF(E9=\"\",\"\",LOOKUP(E9,Miniplan,'Plan comptable'!$A$2:$A$78)))","v":""},""]
[{"$nulls":3},{"$f":"IF(C10>0,VLOOKUP(C10,'Plan comptable'!$B$2:$C$123,2),\"\")","v":""},null,{"$f":"IF(E10>0,VLOOKUP(E10,'Plan comptable'!$B$2:$C$123,2),\"\")","v":""},null,null,{"v":0,"d":"0.00"},{"$f":"IF($L10=\"\",\"\",IF(C10=\"\",\"\",LOOKUP(C10,Miniplan,'Plan comptable'!$A$2:$A$78)))","v":""},{"$f":"IF($L10=\"\",\"\",IF(E10=\"\",\"\",LOOKUP(E10,Miniplan,'Plan comptable'!$A$2:$A$78)))","v":""},""]
[{"$nulls":3},{"$f":"IF(C11>0,VLOOKUP(C11,'Plan comptable'!$B$2:$C$123,2),\"\")","v":""},null,{"$f":"IF(E11>0,VLOOKUP(E11,'Plan comptable'!$B$2:$C$123,2),\"\")","v":""},null,null,{"v":0,"d":"0.00"},{"$f":"IF($L11=\"\",\"\",IF(C11=\"\",\"\",LOOKUP(C11,Miniplan,'Plan comptable'!$A$2:$A$78)))","v":""},{"$f":"IF($L11=\"\",\"\",IF(E11=\"\",\"\",LOOKUP(E11,Miniplan,'Plan comptable'!$A$2:$A$78)))","v":""},""]
[{"$nulls":3},{"$f":"IF(C12>0,VLOOKUP(C12,'Plan comptable'!$B$2:$C$123,2),\"\")","v":""},null,{"$f":"IF(E12>0,VLOOKUP(E12,'Plan comptable'!$B$2:$C$123,2),\"\")","v":""},null,null,{"v":0,"d":"0.00"},{"$f":"IF($L12=\"\",\"\",IF(C12=\"\",\"\",LOOKUP(C12,Miniplan,'Plan comptable'!$A$2:$A$78)))","v":""},{"$f":"IF($L12=\"\",\"\",IF(E12=\"\",\"\",LOOKUP(E12,Miniplan,'Plan comptable'!$A$2:$A$78)))","v":""},""]
[{"$nulls":3},{"$f":"IF(C13>0,VLOOKUP(C13,'Plan comptable'!$B$2:$C$123,2),\"\")","v":""},null,{"$f":"IF(E13>0,VLOOKUP(E13,'Plan comptable'!$B$2:$C$123,2),\"\")","v":""},null,null,{"v":0,"d":"0.00"},{"$f":"IF($L13=\"\",\"\",IF(C13=\"\",\"\",LOOKUP(C13,Miniplan,'Plan comptable'!$A$2:$A$78)))","v":""},{"$f":"IF($L13=\"\",\"\",IF(E13=\"\",\"\",LOOKUP(E13,Miniplan,'Plan comptable'!$A$2:$A$78)))","v":""},""]
[{"$nulls":3},{"$f":"IF(C14>0,VLOOKUP(C14,'Plan comptable'!$B$2:$C$123,2),\"\")","v":""},null,{"$f":"IF(E14>0,VLOOKUP(E14,'Plan comptable'!$B$2:$C$123,2),\"\")","v":""},null,null,{"v":0,"d":"0.00"},{"$f":"IF($L14=\"\",\"\",IF(C14=\"\",\"\",LOOKUP(C14,Miniplan,'Plan comptable'!$A$2:$A$78)))","v":""},{"$f":"IF($L14=\"\",\"\",IF(E14=\"\",\"\",LOOKUP(E14,Miniplan,'Plan comptable'!$A$2:$A$78)))","v":""},""]
[{"$nulls":3},{"$f":"IF(C15>0,VLOOKUP(C15,'Plan comptable'!$B$2:$C$123,2),\"\")","v":""},null,{"$f":"IF(E15>0,VLOOKUP(E15,'Plan comptable'!$B$2:$C$123,2),\"\")","v":""},null,null,{"v":0,"d":"0.00"},{"$f":"IF($L15=\"\",\"\",IF(C15=\"\",\"\",LOOKUP(C15,Miniplan,'Plan comptable'!$A$2:$A$78)))","v":""},{"$f":"IF($L15=\"\",\"\",IF(E15=\"\",\"\",LOOKUP(E15,Miniplan,'Plan comptable'!$A$2:$A$78)))","v":""},""]
[{"$nulls":3},{"$f":"IF(C16>0,VLOOKUP(C16,'Plan comptable'!$B$2:$C$123,2),\"\")","v":""},null,{"$f":"IF(E16>0,VLOOKUP(E16,'Plan comptable'!$B$2:$C$123,2),\"\")","v":""},null,null,{"v":0,"d":"0.00"},{"$f":"IF($L16=\"\",\"\",IF(C16=\"\",\"\",LOOKUP(C16,Miniplan,'Plan comptable'!$A$2:$A$78)))","v":""},{"$f":"IF($L16=\"\",\"\",IF(E16=\"\",\"\",LOOKUP(E16,Miniplan,'Plan comptable'!$A$2:$A$78)))","v":""},""]
[{"$nulls":3},{"$f":"IF(C17>0,VLOOKUP(C17,'Plan comptable'!$B$2:$C$123,2),\"\")","v":""},null,{"$f":"IF(E17>0,VLOOKUP(E17,'Plan comptable'!$B$2:$C$123,2),\"\")","v":""},null,null,{"v":0,"d":"0.00"},{"$f":"IF($L17=\"\",\"\",IF(C17=\"\",\"\",LOOKUP(C17,Miniplan,'Plan comptable'!$A$2:$A$78)))","v":""},{"$f":"IF($L17=\"\",\"\",IF(E17=\"\",\"\",LOOKUP(E17,Miniplan,'Plan comptable'!$A$2:$A$78)))","v":""},""]
[{"$nulls":3},{"$f":"IF(C18>0,VLOOKUP(C18,'Plan comptable'!$B$2:$C$123,2),\"\")","v":""},null,{"$f":"IF(E18>0,VLOOKUP(E18,'Plan comptable'!$B$2:$C$123,2),\"\")","v":""},null,null,{"v":0,"d":"0.00"},{"$f":"IF($L18=\"\",\"\",IF(C18=\"\",\"\",LOOKUP(C18,Miniplan,'Plan comptable'!$A$2:$A$78)))","v":""},{"$f":"IF($L18=\"\",\"\",IF(E18=\"\",\"\",LOOKUP(E18,Miniplan,'Plan comptable'!$A$2:$A$78)))","v":""},""]
[{"$nulls":3},{"$f":"IF(C19>0,VLOOKUP(C19,'Plan comptable'!$B$2:$C$123,2),\"\")","v":""},null,{"$f":"IF(E19>0,VLOOKUP(E19,'Plan comptable'!$B$2:$C$123,2),\"\")","v":""},null,null,{"v":0,"d":"0.00"},{"$f":"IF($L19=\"\",\"\",IF(C19=\"\",\"\",LOOKUP(C19,Miniplan,'Plan comptable'!$A$2:$A$78)))","v":""},{"$f":"IF($L19=\"\",\"\",IF(E19=\"\",\"\",LOOKUP(E19,Miniplan,'Plan comptable'!$A$2:$A$78)))","v":""},""]
[{"$nulls":3},{"$f":"IF(C20>0,VLOOKUP(C20,'Plan comptable'!$B$2:$C$123,2),\"\")","v":""},null,{"$f":"IF(E20>0,VLOOKUP(E20,'Plan comptable'!$B$2:$C$123,2),\"\")","v":""},null,null,{"v":0,"d":"0.00"},{"$f":"IF($L20=\"\",\"\",IF(C20=\"\",\"\",LOOKUP(C20,Miniplan,'Plan comptable'!$A$2:$A$78)))","v":""},{"$f":"IF($L20=\"\",\"\",IF(E20=\"\",\"\",LOOKUP(E20,Miniplan,'Plan comptable'!$A$2:$A$78)))","v":""},""]
{"$rows_left_out":87}
{"sheet":"Un compte","index":2,"n_rows":100,"n_cols":36,"rows_kept":100,"merged":[[5,1,5,7],[6,2,6,3],[6,4,6,5],[6,11,7,16],[6,26,7,29],[6,32,7,35],[8,26,8,27],[8,28,8,29],[8,32,8,33],[8,34,8,35]]}
[]
[]
[]
[]
[{"$nulls":11},6,25,4,null,null,true]
[]
[{"$nulls":11},{"$f":"VLOOKUP(M5,Plan,3)","v":"Dettes LPP"},{"$nulls":7},"Plan comptable",{"$nulls":6},"Résultat",{"$nulls":5},"Bilan"]
[{"$nulls":8},{"$f":"IF($H8=\"\",\"\",LOOKUP(C8,$T$8:$T$26,$S$8:$S$26))","v":""},{"$f":"IF($H8=\"\",\"\",LOOKUP(E8,$T$8:$T$26,$S$8:$S$26))","v":""},{"$nulls":8},{"$f":"'Plan comptable'!A2","v":1},{"$f":"'Plan comptable'!B2","v":1000},{"$f":"'Plan comptable'!C2","v":"Caisse"}]
[{"$nulls":8},"","",null,"No","C/partie","Libellé","Débit","Crédit","Solde",null,{"$f":"'Plan comptable'!A3","v":2},{"$f":"'Plan comptable'!B3","v":1010},{"$f":"'Plan comptable'!C3","v":"Poste"},{"$nulls":5},"Charges",null,"Produits",{"$nulls":3},"Actif",null,"Passif"]
[{"$nulls":8},"","",{"$nulls":8},{"$f":"'Plan comptable'!A4","v":3},{"$f":"'Plan comptable'!B4","v":1020},{"$f":"'Plan comptable'!C4","v":"Banque"}]
[{"$nulls":8},"","",{"$nulls":8},{"$f":"'Plan comptable'!A5","v":4},{"$f":"'Plan comptable'!B5","v":1040},{"$f":"'Plan comptable'!C5","v":"Effets à recevoir"}]
[{"$nulls":8},"","",{"$nulls":8},{"$f":"'Plan comptable'!A6","v":5},{"$f":"'Plan comptable'!B6","v":1060},{"$f":"'Plan comptable'!C6","v":"Titres"}]
[{"$nulls":8},"","",{"$nulls":8},{"$f":"'Plan comptable'!A7","v":6},{"$f":"'Plan comptable'!B7","v":1100},{"$f":"'Plan comptable'!C7","v":"Créances clients"}]
[{"$nulls":8},"","",{"$nulls":8},{"$f":"'Plan comptable'!A8","v":7},{"$f":"'Plan comptable'!B8","v":1108},{"$f":"'Plan comptable'!C8","v":"Créances douteuses"}]
[{"$nulls":8},"","",{"$nulls":8},{"$f":"'Plan comptable'!A9","v":8},{"$f":"'Plan comptable'!B9","v":1109},{"$f":"'Plan comptable'!C9","v":"Provision s/créances"}]
[{"$nulls":8},"","",{"$nulls":8},{"$f":"'Plan comptable'!A10","v":9},{"$f":"'Plan comptable'!B10","v":1170},{"$f":"'Plan comptable'!C10","v":"IP préalable s/mar."}]
[{"$nulls":8},"","",{"$nulls":8},{"$f":"'Plan comptable'!A11","v":10},{"$f":"'Plan comptable'!B11","v":1171},{"$f":"'Plan comptable'!C11","v":"IP préalable s/inv."}]
[{"$nulls":8},"","",{"$nulls":8},{"$f":"'Plan comptable'!A12","v":11},{"$f":"'Plan comptable'!B12","v":1200},{"$f":"'Plan comptable'!C12","v":"Stock marchandises"}]
[{"$nulls":8},"","",{"$nulls":8},{"$f":"'Plan comptable'!A13","v":12},{"$f":"'Plan comptable'!B13","v":1300},{"$f":"'Plan comptable'!C13","v":"Actifs transitoires"}]
[{"$nulls":8},"","",{"$nulls":8},{"$f":"'Plan comptable'!A14","v":13},{"$f":"'Plan comptable'!B14","v":1301},{"$f":"'Plan comptable'!C14","v":"Ch. payées d'av."}]
{"$rows_left_out":81}
{"sheet":"Plan comptable","index":3,"n_rows":88,"n_cols":5,"rows_kept":88}
[null,"Zone \"Plan\"",null,null,"Choisir un compte"]
[1,1000,"Caisse",null,{"$f":"B2&\"  \"&C2","v":"1000  Caisse"}]
[2,1010,"Poste",null,{"$f":"B3&\"  \"&C3","v":"1010  Poste"}]
[3,1020,"Banque",null,"1020  Banque"]
[4,1040,"Effets à recevoir",null,"1040  Effets à recevoir"]
[5,1060,"Titres",null,"1060  Titres"]
[6,1100,"Créances clients",null,"1100  Créances clients"]
[7,1108,"Créances douteuses",null,"1108  Créances douteuses"]
[8,1109,"Provision s/créances",null,"1109  Provision s/créances"]
[9,1170,"IP préalable s/mar.",null,{"$f":"B12&\"  \"&C12","v":"1200  Stock marchandises"}]
[10,1171,"IP préalable s/inv.",null,"1300  Actifs transitoires"]
[11,1200,"Stock marchandises",null,"1301  Ch. payées d'av."]
[12,1300,"Actifs transitoires",null,"1302  Prod. à recevoir"]
[13,1301,"Ch. payées d'av.",null,"1500  Machines"]
[14,1302,"Prod. à recevoir",null,"1501  Informatique"]
[15,1500,"Machines",null,"1510  Mobilier"]
[16,1501,"Informatique",null,"1530  Véhicules"]
[17,1510,"Mobilier",null,"1600  Immeuble"]
[18,1530,"Véhicules",null,"1770  Fonds de commerce"]
[19,1600,"Immeuble",null,{"$f":"#REF!&\"  \"&#REF!","v":{"$error":"#REF!"}}]
{"$rows_left_out":69}
{"sheet":"Journal imprimable","index":4,"n_rows":106,"n_cols":9,"rows_kept":106,"merged":[[3,1,4,1],[3,2,3,5],[3,6,4,6],[3,7,3,8],[4,2,4,3],[4,4,4,5]]}
[]
[]
[null,{"$f":"Solutions!B3","v":"Exercice : "},{"$nulls":6},false]
[null,"No","Comptes à",{"$nulls":3},"Libellé","Sommes à"]
[null,null,"débiter",null,"créditer",null,null,"débiter","créditer"]
["v",{"$f":"IF(D6=\"\",\"\",'Pas à pas'!B6)","v":""},{"$f":"'Pas à pas'!C6","v":""},{"$f":"'Pas à pas'!D6","v":""},{"$f":"'Pas à pas'!E6","v":""},{"$f":"'Pas à pas'!F6","v":""},{"$f":"'Pas à pas'!G6","v":""},{"$f":"'Pas à pas'!H6","v":""},{"$f":"'Pas à pas'!I6","v":""}]
["v",{"$f":"IF(D7=\"\",\"\",'Pas à pas'!B7)","v":""},{"$f":"'Pas à pas'!C7","v":""},{"$f":"'Pas à pas'!D7","v":""},{"$f":"'Pas à pas'!E7","v":""},{"$f":"'Pas à pas'!F7","v":""},{"$f":"'Pas à pas'!G7","v":""},{"$f":"'Pas à pas'!H7","v":""},{"$f":"'Pas à pas'!I7","v":""}]
["v",{"$f":"IF(D8=\"\",\"\",'Pas à pas'!B8)","v":""},{"$f":"'Pas à pas'!C8","v":""},{"$f":"'Pas à pas'!D8","v":""},{"$f":"'Pas à pas'!E8","v":""},{"$f":"'Pas à pas'!F8","v":""},{"$f":"'Pas à pas'!G8","v":""},{"$f":"'Pas à pas'!H8","v":""},{"$f":"'Pas à pas'!I8","v":""}]
["v",{"$f":"IF(D9=\"\",\"\",'Pas à pas'!B9)","v":""},{"$f":"'Pas à pas'!C9","v":""},{"$f":"'Pas à pas'!D9","v":""},{"$f":"'Pas à pas'!E9","v":""},{"$f":"'Pas à pas'!F9","v":""},{"$f":"'Pas à pas'!G9","v":""},{"$f":"'Pas à pas'!H9","v":""},{"$f":"'Pas à pas'!I9","v":""}]
["v",{"$f":"IF(D10=\"\",\"\",'Pas à pas'!B10)","v":""},{"$f":"'Pas à pas'!C10","v":""},{"$f":"'Pas à pas'!D10","v":""},{"$f":"'Pas à pas'!E10","v":""},{"$f":"'Pas à pas'!F10","v":""},{"$f":"'Pas à pas'!G10","v":""},{"$f":"'Pas à pas'!H10","v":""},{"$f":"'Pas à pas'!I10","v":""}]
["v",{"$f":"IF(D11=\"\",\"\",'Pas à pas'!B11)","v":""},{"$f":"'Pas à pas'!C11","v":""},{"$f":"'Pas à pas'!D11","v":""},{"$f":"'Pas à pas'!E11","v":""},{"$f":"'Pas à pas'!F11","v":""},{"$f":"'Pas à pas'!G11","v":""},{"$f":"'Pas à pas'!H11","v":""},{"$f":"'Pas à pas'!I11","v":""}]
["v",{"$f":"IF(D12=\"\",\"\",'Pas à pas'!B12)","v":""},{"$f":"'Pas à pas'!C12","v":""},{"$f":"'Pas à pas'!D12","v":""},{"$f":"'Pas à pas'!E12","v":""},{"$f":"'Pas à pas'!F12","v":""},{"$f":"'Pas à pas'!G12","v":""},{"$f":"'Pas à pas'!H12","v":""},{"$f":"'Pas à pas'!I12","v":""}]
["v",{"$f":"IF(D13=\"\",\"\",'Pas à pas'!B13)","v":""},{"$f":"'Pas à pas'!C13","v":""},{"$f":"'Pas à pas'!D13","v":""},{"$f":"'Pas à pas'!E13","v":""},{"$f":"'Pas à pas'!F13","v":""},{"$f":"'Pas à pas'!G13","v":""},{"$f":"'Pas à pas'!H13","v":""},{"$f":"'Pas à pas'!I13","v":""}]
["v",{"$f":"IF(D14=\"\",\"\",'Pas à pas'!B14)","v":""},{"$f":"'Pas à pas'!C14","v":""},{"$f":"'Pas à pas'!D14","v":""},{"$f":"'Pas à pas'!E14","v":""},{"$f":"'Pas à pas'!F14","v":""},{"$f":"'Pas à pas'!G14","v":""},{"$f":"'Pas à pas'!H14","v":""},{"$f":"'Pas à pas'!I14","v":""}]
["v",{"$f":"IF(D15=\"\",\"\",'Pas à pas'!B15)","v":""},{"$f":"'Pas à pas'!C15","v":""},{"$f":"'Pas à pas'!D15","v":""},{"$f":"'Pas à pas'!E15","v":""},{"$f":"'Pas à pas'!F15","v":""},{"$f":"'Pas à pas'!G15","v":""},{"$f":"'Pas à pas'!H15","v":""},{"$f":"'Pas à pas'!I15","v":""}]
["v",{"$f":"IF(D16=\"\",\"\",'Pas à pas'!B16)","v":""},{"$f":"'Pas à pas'!C16","v":""},{"$f":"'Pas à pas'!D16","v":""},{"$f":"'Pas à pas'!E16","v":""},{"$f":"'Pas à pas'!F16","v":""},{"$f":"'Pas à pas'!G16","v":""},{"$f":"'Pas à pas'!H16","v":""},{"$f":"'Pas à pas'!I16","v":""}]
["v",{"$f":"IF(D17=\"\",\"\",'Pas à pas'!B17)","v":""},{"$f":"'Pas à pas'!C17","v":""},{"$f":"'Pas à pas'!D17","v":""},{"$f":"'Pas à pas'!E17","v":""},{"$f":"'Pas à pas'!F17","v":""},{"$f":"'Pas à pas'!G17","v":""},{"$f":"'Pas à pas'!H17","v":""},{"$f":"'Pas à pas'!I17","v":""}]
["v",{"$f":"IF(D18=\"\",\"\",'Pas à pas'!B18)","v":""},{"$f":"'Pas à pas'!C18","v":""},{"$f":"'Pas à pas'!D18","v":""},{"$f":"'Pas à pas'!E18","v":""},{"$f":"'Pas à pas'!F18","v":""},{"$f":"'Pas à pas'!G18","v":""},{"$f":"'Pas à pas'!H18","v":""},{"$f":"'Pas à pas'!I18","v":""}]
["v",{"$f":"IF(D19=\"\",\"\",'Pas à pas'!B19)","v":""},{"$f":"'Pas à pas'!C19","v":""},{"$f":"'Pas à pas'!D19","v":""},{"$f":"'Pas à pas'!E19","v":""},{"$f":"'Pas à pas'!F19","v":""},{"$f":"'Pas à pas'!G19","v":""},{"$f":"'Pas à pas'!H19","v":""},{"$f":"'Pas à pas'!I19","v":""}]
["v",{"$f":"IF(D20=\"\",\"\",'Pas à pas'!B20)","v":""},{"$f":"'Pas à pas'!C20","v":""},{"$f":"'Pas à pas'!D20","v":""},{"$f":"'Pas à pas'!E20","v":""},{"$f":"'Pas à pas'!F20","v":""},{"$f":"'Pas à pas'!G20","v":""},{"$f":"'Pas à pas'!H20","v":""},{"$f":"'Pas à pas'!I20","v":""}]
{"$rows_left_out":86}