{"text_format":"3","workbook":"xlsx","n_sheets":3,"sheets":["Echelle","Grille","Conversions"],"not_rendered":{"charts":1,"macros":1,"defined_names":5},"read":"whole","date_system":"1900"}

{"sheet":"Echelle","index":0,"n_rows":63,"n_cols":22,"rows_kept":63,"merged":[[1,1,1,5],[2,9,2,22],[3,9,3,22],[4,9,4,22],[7,8,7,9]]}
[]
[null,"Echelle de notes"]
[{"$nulls":9},"Etablissement"]
[null,"Evaluation en points",{"$nulls":3},{"$f":"IF(H4=TRUE,\"p\",\"f\")","v":"p"},null,true,null,"Nom du travail"]
[null,"(points ou fautes)",{"$nulls":7},"Date"]
[null," 1/2  ",{"$f":"IF(F4=\"f\",\"fautes\",\"points\")","v":"points"},null,null,{"$f":"IF(H6=TRUE,\"oui\",\"non\")","v":"non"},null,false,{"$nulls":3},{"$f":"IF(F6=\"oui\",0.5,1)","v":1}]
[]
[{"$nulls":4},{"$f":"C6","v":"points"},"note",null,null," ",null,null,"dif.  pt","dif.no","pente","cons",null,null,"dif p","dif n","pente","const"]
[null,"performence max.",null,null,30,6,{"$nulls":4},"A",{"$f":"E9-E10","v":18},{"$f":"F9-F10","v":2},{"$f":"M9/L9","v":0.1111111111111111},{"$f":"F9-(E9*N9)","v":2.666666666666667},null,null,{"$f":"E10-E9","v":-18},{"$f":"F9-F10","v":2},{"$f":"S9/R9","v":-0.1111111111111111},{"$f":"F9-(-E9*T9)","v":2.666666666666667}]
[null,"seuil",null,null,12,4,{"$nulls":4},"B",{"$f":"E10-E11","v":10},{"$f":"F10-F11","v":2.5},{"$f":"M10/L10","v":0.25},{"$f":"F10-(E10*N10)","v":1},null,null,{"$f":"E11-E10","v":-10},{"$f":"F10-F11","v":2.5},{"$f":"S10/R10","v":-0.25},{"$f":"F10-(-E10*T10)","v":1}]
[null,"performence min.",null,null,2,1.5]
[]
[null,{"$f":"C6","v":"points"},"  note",null,{"$f":"C6","v":"points"},"  note",{"$nulls":4},"par pt"]
[null,{"$f":"IF($F$4=\"p\",IF($L14>0.5,ROUND(K14*2,0)/2,\"\"),IF($S14>0.5,ROUND(R14*2,0)/2,\"\"))","v":30},{"$f":"IF($F$4=\"p\",IF($L14>0.5,ROUND(L14*$Q$36,0)/$Q$36,\"\"),IF($S14>0.5,ROUND(S14*$Q$36,0)/$Q$36,\"\"))","v":6},{"$f":"IF(C14=\"\",\"\",VLOOKUP(C14,IF($F$9>6,Lettres2,Lettres),2))","v":"A"},{"$f":"IF($F$4=\"p\",IF($L14>0.5,ROUND(N14*2,0)/2,\"\"),IF($S14>0.5,ROUND(U14*2,0)/2,\"\"))","v":29},{"$f":"IF($F$4=\"p\",IF($L14>0.5,ROUND(O14*$Q$36,0)/$Q$36,\"\"),IF($S14>0.5,ROUND(V14*$Q$36,0)/$Q$36,\"\"))","v":6},{"$f":"IF(F14=\"\",\"\",VLOOKUP(F14,IF($F$9>6,Lettres2,Lettres),2))","v":"A"},{"$nulls":3},{"$f":"E9","v":30},{"$f":"IF(K14>=$E$10,(K14*$N$9)+$O$9,(K14*$N$10)+$O$10)","v":6},null,{"$f":"K14-$L$6","v":29},{"$f":"IF(N14>=$E$10,(N14*$N$9)+$O$9,(N14*$N$10)+$O$10)","v":5.888888888888889},null,null,{"$f":"E9","v":30},{"$f":"IF(R14<=$E$10,(-$T$9*R14)+$U$9,(-$T$10*R14)+$U$10)","v":8.5},null,{"$f":"R14+$L$6","v":31},{"$f":"IF(U14<=$E$10,(-$T$9*U14)+$U$9,(-$T$10*U14)+$U$10)","v":8.75}]
[null,28,{"$f":"IF($F$4=\"p\",IF($L15>0.5,ROUND(L15*$Q$36,0)/$Q$36,\"\"),IF($S15>0.5,ROUND(S15*$Q$36,0)/$Q$36,\"\"))","v":6},"A",27,{"$f":"IF($F$4=\"p\",IF($L15>0.5,ROUND(O15*$Q$36,0)/$Q$36,\"\"),IF($S15>0.5,ROUND(V15*$Q$36,0)/$Q$36,\"\"))","v":5.5},"B",{"$nulls":3},{"$f":"N14-$L$6","v":28},5.777777777777778,null,27,5.666666666666667,null,null,{"$f":"U14+$L$6","v":32},9,null,33,9.25]
[null,26,5.5,"B",25,5.5,"B",{"$nulls":3},26,5.555555555555555,null,25,5.444444444444445,null,null,34,9.5,null,35,9.75]
[null,24,5.5,"B",23,5,"C",{"$nulls":3},24,5.333333333333334,null,23,5.222222222222222,null,null,36,10,null,37,10.25]
[null,22,5,"C",21,5,"C",{"$nulls":3},22,5.111111111111111,null,21,5,null,null,38,10.5,null,39,10.75]
[null,20,5,"C",19,5,"C",{"$nulls":3},20,4.888888888888889,null,19,4.777777777777779,null,null,40,11,null,41,11.25]
[null,18,4.5,"D",17,4.5,"D",{"$nulls":3},18,4.666666666666667,null,17,4.555555555555555,null,null,42,11.5,null,43,11.75]
[null,16,4.5,"D",15,4.5,"D",{"$nulls":3},16,4.444444444444445,null,15,4.333333333333334,null,null,44,12,null,45,12.25]
[null,14,4,"E",13,4,"E",{"$nulls":3},14,4.222222222222222,null,13,4.111111111111112,null,null,46,12.5,null,47,12.75]
[null,12,4,"E",11,4,"E",{"$nulls":3},12,4,null,11,3.75,null,null,48,13,null,49,13.25]
[null,10,3.5,"F",9,3.5,"F",{"$nulls":3},10,3.5,null,9,3.25,null,null,50,13.5,null,51,13.75]
[null,8,3,"F",7,3,"F",{"$nulls":3},8,3,null,7,2.75,null,null,52,14,null,53,14.25]
[null,6,2.5,"F",5,2.5,"F",{"$nulls":3},6,2.5,null,5,2.25,null,null,54,14.5,null,55,14.75]
[null,4,2,"F",3,2,"F",{"$nulls":3},4,2,null,3,1.75,null,null,56,15,null,57,15.25]
[null,2,1.5,"F",1,1.5,"F",{"$nulls":3},2,1.5,null,1,1.25,null,null,58,15.5,null,59,15.75]
[null,0,1,"F",-1,1,"F",{"$nulls":3},0,1,null,-1,0.75,null,null,60,16,null,61,16.25]
[null,"","","","","","",{"$nulls":3},-2,0.5,null,-3,0.25,null,null,62,16.5,null,63,16.75]
[null,{"$f":"IF($F$4=\"p\",IF($L31>0.5,ROUND(K31*2,0)/2,\"\"),IF($S31>0.5,ROUND(R31*2,0)/2,\"\"))","v":""},"","",{"$f":"IF($F$4=\"p\",IF($L31>0.5,ROUND(N31*2,0)/2,\"\"),IF($S31>0.5,ROUND(U31*2,0)/2,\"\"))","v":""},"","",{"$nulls":3},-4,0,null,-5,-0.25,null,null,64,17,null,65,17.25]
[null,"","","","","","",{"$nulls":3},-6,-0.5,null,-7,-0.75,null,null,66,17.5,null,67,17.75]
[null,"","","","","","",{"$nulls":3},-8,-1,null,-9,-1.25,null,null,68,18,null,69,18.25]
[null,"","","","","","",{"$nulls":3},-10,-1.5,null,-11,-1.75,null,"Arrondi",70,18.5,null,71,18.75]
[null,"","","","","","",{"$nulls":3},-12,-2,null,-13,-2.25,null,1,72,19,null,73,19.25]
[null,"","","","","","",{"$nulls":3},-14,-2.5,null,-15,-2.75,null,{"$f":"IF(Q35=1,2,IF(Q35=2,5,1))","v":2},74,19.5,null,75,19.75]
[null,"","","","","","",{"$nulls":3},-16,-3,null,-17,-3.25,null,null,76,20,null,77,20.25]
[null,"","","","","","",null,{"$f":"IF($F$4=\"p\",IF($L63>0.5,ROUND(K63*2,0)/2,\"\"),IF($S63>0.5,ROUND(R63*2,0)/2,\"\"))","v":""},null,-18,-3.5,null,-19,-3.75,null,null,78,20.5,null,79,20.75]
[null,"","","","","","",{"$nulls":3},-20,-4,null,-21,-4.25,null,null,80,21,null,81,21.25]
[null,"","","","","","",{"$nulls":3},-22,-4.5,null,-23,-4.75,null,null,82,21.5,null,83,21.75]
{"$rows_left_out":24}
{"sheet":"Grille","index":1,"n_rows":107,"n_cols":41,"rows_kept":107,"merged":[[1,12,1,13],[2,10,2,11],[2,12,2,13],[2,21,3,24],[3,10,3,13],[4,12,4,13],[4,21,4,22],[4,23,4,24],[4,26,4,31],[5,2,5,5],[6,2,6,5],[7,2,7,5],[8,2,8,5],[9,2,9,5],[10,2,10,5],[11,2,11,5],[12,2,12,5],[13,2,13,5],[14,2,14,5],[15,2,15,5],[16,2,16,5],[17,2,17,5],[18,2,18,5],[19,2,19,5],[20,2,20,5],[21,2,21,5],[22,2,22,5],[23,2,23,5],[24,2,24,5],[25,2,25,5],[26,2,26,5],[27,2,27,5],[28,2,28,5],[29,2,29,5],[30,2,30,5],[31,2,31,5],[32,2,32,5],[33,2,33,5],[34,2,34,5],[35,2,35,5],[36,2,36,5],[37,2,37,5],[38,2,38,5],[39,2,39,5],[40,2,40,5],[41,2,41,5],[42,2,42,5],[43,2,43,5],[44,2,44,5],[45,2,45,5],[46,2,46,5],[47,2,47,5],[48,2,48,5],[49,2,49,5],[50,2,50,5],[51,2,51,5],[52,2,52,5],[53,2,53,5],[54,2,54,5],[55,2,55,5],[56,2,56,5],[57,2,57,5],[58,2,58,5],[59,2,59,5],[60,2,60,5],[61,2,61,5],[62,2,62,5],[63,2,63,5],[64,2,64,5],[65,2,65,5],[66,2,66,5],[67,2,67,5],[68,2,68,5],[69,2,69,5],[70,2,70,5],[71,2,71,5],[72,2,72,5],[73,2,73,5],[74,2,74,5],[75,2,75,5],[76,2,76,5],[77,2,77,5],[78,2,78,5],[79,2,79,5],[80,2,80,5],[81,2,81,5],[82,2,82,5],[83,2,83,5],[84,2,84,5],[85,2,85,5],[86,2,86,5],[87,2,87,5],[88,2,88,5],[89,2,89,5],[90,2,90,5],[91,2,91,5],[92,2,92,5],[93,2,93,5],[94,2,94,5],[95,2,95,5],[96,2,96,5],[97,2,97,5],[98,2,98,5],[99,2,99,5],[100,2,100,5],[101,2,101,5],[102,2,102,5],[103,2,103,5],[104,2,104,5],[105,2,105,5]]}
[null,"Réglages dans la feuille \"Echelle\"",{"$nulls":5},1,{"$nulls":8},"paire/impaire"]
[null,"Evaluation en points",{"$nulls":3},{"$f":"IF(H2=TRUE,\"p\",\"f\")","v":"p"},"Maximum :",{"$f":"Echelle!H4","v":true},{"$f":"Echelle!B14","v":30},null,null,"Nb élèves :",{"$f":"SUM(K6:K105)","v":24},{"$nulls":3},{"$f":"I2","v":30},{"$f":"IF(ROUND((Q2/2),0)=Q2/2,0,1)","v":0},"Voir détail",false,{"$nulls":18},"100% :",{"$f":"SUM(AI4:AM4)","v":18},{"$f":"SUM(AI4:AN4)","v":24}]
[null,"(points ou fautes)",{"$nulls":5},{"$f":"IF(F4=\"non\",1,0.5)","v":1},null,null,"Moyenne :",null,{"$f":"Q5/M2","v":4.25},{"$nulls":3},{"$f":"Echelle!E9","v":30},{"$f":"IF(ROUND((Q3/2),0)=Q3/2,0,1)","v":0},null,"seuil",{"$f":"Echelle!F10","v":4},"% ECTS (hors échecs)"]
[null," 1/2  ",{"$f":"IF(F2=\"f\",\"fautes\",\"points\")","v":"points"},null,null,{"$f":"IF(H4=TRUE,\"oui\",\"non\")","v":"non"},null,{"$f":"Echelle!H6","v":false},null,null,"Statistiques",{"$nulls":5},"somme",{"$f":"SUM(R2:R3)","v":0},null,"tot au seuil",{"$f":"VLOOKUP(Echelle!F10,S6:T105,2,FALSE)","v":18},{"$nulls":13},{"$f":"SUM(AI6:AI106)","v":1},{"$f":"SUM(AJ6:AJ106)","v":2},3,8,4,6]
[{"$nulls":6},"Notes ",2,"Lettres",null,"nb","% (arrondis)","% cumulés",null,"Ordre inverse",null,{"$f":"SUM(Q6:Q106)","v":102},null,null,"nb",null,"% (arrondis)",null,"% cumulés",null,null,"% ECTS",{"$nulls":7},"A","B","C","D","E","F"]
[null,{"$f":"IF(F2=\"f\",0,I2)","v":30},{"$nulls":4},{"$f":"IF(H6=1,VLOOKUP(B6,TableauA,2,FALSE),VLOOKUP(B6,TableauB,2,FALSE))","v":6},{"$f":"IF($R$4=1,0,1)","v":1},{"$f":"IF(H6=1,VLOOKUP(B6,TableauA,3,FALSE),VLOOKUP(B6,TableauB,3,FALSE))","v":"A"},null,{"$f":"LEN(C6)","v":0},{"$f":"ROUND(K6*100/$M$2,1)&\" %\"","v":"0 %"},{"$f":"ROUND((K6*100/$M$2),0)","v":0},{"$f":"IF(K6=0,\"\",\"%\")","v":""},{"$f":"100-M6&\" %\"","v":"100 %"},null,{"$f":"IF(ISNUMBER(G6)=TRUE,G6*K6,0)","v":0},{"$f":"G6","v":6},{"$f":"IF(R7=R6,0,R6)","v":0},{"$f":"K6","v":0},null,{"$f":"IF(G6<$U$3,\"\", ROUND((K6*100/$U$4),0))","v":0},{"$f":"IF(K6=0,\"\",\"%\")","v":""},{"$f":"IF(G6<$U$3,0,ROUND((K6*100/$U$4),0))","v":0},{"$f":"IF(K6=0,\"\",\"%\")","v":""},null,"A",{"v":0.1,"d":"10%"},{"$f":"ROUND((AI$4*100/$AN$2),0)","v":6},"%",{"$f":"ROUND((AI$4*100/$AO$2),0)","v":4},"%",null,{"$f":"ISERROR(I6)","v":false},{"$f":"IF($AH6=FALSE,IF($I6=\"A\",($K6),0),0)","v":0},{"$f":"IF($AH6=FALSE,IF($I6=\"B\",($K6),0),0)","v":0},{"$f":"IF($AH6=FALSE,IF($I6=\"C\",($K6),0),0)","v":0},{"$f":"IF($AH6=FALSE,IF($I6=\"D\",($K6),0),0)","v":0},{"$f":"IF($AH6=FALSE,IF($I6=\"E\",($K6),0),0)","v":0},{"$f":"IF($AH6=FALSE,IF($I6=\"F\",($K6),0),0)","v":0}]
[null,{"$f":"IF($F$2=\"f\",B6+$H$3,B6-$H$3)","v":29},{"$nulls":4},6,{"$f":"IF($R$4=1,1,0)","v":0},"A",null,{"$f":"LEN(C7)","v":0},{"$f":"ROUND(K7*100/$M$2,0)&\" %\"","v":"0 %"},{"$f":"ROUND((K7*100/$M$2) +M6,0)","v":0},{"$f":"IF(K7=0,\"\",\"%\")","v":""},{"$f":"100-M7&\" %\"","v":"100 %"},null,{"$f":"IF(ISNUMBER(G7)=TRUE,G7*K7,0)","v":0},{"$f":"G7","v":6},{"$f":"IF(R8=R7,0,R7)","v":0},{"$f":"T6+K7","v":0},null,{"$f":"IF(G7<$U$3,\"\", ROUND((K7*100/$U$4),0))","v":0},{"$f":"IF(K7=0,\"\",\"%\")","v":""},{"$f":"IF(G7<$U$3,0,ROUND((K7*100/$U$4),0)+X6)","v":0},{"$f":"IF(K7=0,\"\",\"%\")","v":""},null,"B",{"v":0.25,"d":"25%"},{"$f":"ROUND((AJ$4*100/$AN$2),0)","v":11},"%",{"$f":"ROUND((AJ$4*100/$AO$2),0)","v":8},"%",null,false,{"$f":"IF($AH7=FALSE,IF($I7=\"A\",($K7),0),0)","v":0},{"$f":"IF($AH7=FALSE,IF($I7=\"B\",($K7),0),0)","v":0},{"$f":"IF($AH7=FALSE,IF($I7=\"C\",($K7),0),0)","v":0},{"$f":"IF($AH7=FALSE,IF($I7=\"D\",($K7),0),0)","v":0},{"$f":"IF($AH7=FALSE,IF($I7=\"E\",($K7),0),0)","v":0},{"$f":"IF($AH7=FALSE,IF($I7=\"F\",($K7),0),0)","v":0}]
[null,{"$f":"IF($F$2=\"f\",B7+$H$3,B7-$H$3)","v":28},"x",{"$nulls":3},6,{"$f":"IF($R$4=1,0,1)","v":1},"A",null,1,{"$f":"ROUND(K8*100/$M$2,0)&\" %\"","v":"4 %"},{"$f":"ROUND((K8*100/$M$2) +M7,0)","v":4},"%","96 %",null,6,{"$f":"G8","v":6},6,{"$f":"T7+K8","v":1},null,6,"%",{"$f":"IF(G8<$U$3,0,ROUND((K8*100/$U$4),0)+X7)","v":6},{"$f":"IF(K8=0,\"\",\"%\")","v":"%"},null,"C",{"v":0.3,"d":"30%"},{"$f":"ROUND((AK$4*100/$AN$2),0)","v":17},"%",{"$f":"ROUND((AK$4*100/$AO$2),0)","v":13},"%",null,false,1,0,0,0,0,0]
[null,27,{"$nulls":4},5.5,{"$f":"IF($R$4=1,1,0)","v":0},"B",null,0,"0 %",4,"","96 %"," ",0,5.5,0,1,null,0,"",6,"",null,"D",{"v":0.25,"d":"25%"},{"$f":"ROUND((AL$4*100/$AN$2),0)","v":44},"%",{"$f":"ROUND((AL$4*100/$AO$2),0)","v":33},"%",null,false,0,0,0,0,0,0]
[null,26,"xx",{"$nulls":3},5.5,{"$f":"IF($R$4=1,0,1)","v":1},"B",null,2,"8 %",12,"%","88 %",null,11,5.5,0,3,null,11,"%",17,"%",null,"E",{"v":0.1,"d":"10%"},{"$f":"ROUND((AM$4*100/$AN$2),0)","v":22},"%",{"$f":"ROUND((AM$4*100/$AO$2),0)","v":17},"%",null,false,0,2,0,0,0,0]
[null,25,{"$nulls":4},5.5,{"$f":"IF($R$4=1,1,0)","v":0},"B",null,0,"0 %",12,"","88 %",null,0,5.5,0,3,null,0,"",17,"",null,null,{"v":1,"d":"100%"},{"$f":"SUM(AC6:AC10)","v":100},"%",{"$f":"SUM(AE6:AE10)","v":75},"%",null,false,0,0,0,0,0,0]
[null,24,{"$nulls":4},5.5,{"$f":"IF($R$4=1,0,1)","v":1},"B",null,0,"0 %",12,"","88 %",null,0,5.5,5.5,3,null,0,"",17,"",{"$nulls":8},false,0,0,0,0,0,0]
[null,23,"xx",{"$nulls":3},5,{"$f":"IF($R$4=1,1,0)","v":0},"C",null,2,"8 %",20,"%","80 %",null,10,5,0,5,null,11,"%",28,"%",null,"F",{"$nulls":3},{"$f":"ROUND((AN$4*100/$AO$2),0)","v":25},"%",null,false,0,0,2,0,0,0]
[null,22,{"$nulls":4},5,{"$f":"IF($R$4=1,0,1)","v":1},"C",null,0,"0 %",20,"","80 %",null,0,5,0,5,null,0,"",28,"",{"$nulls":5},{"$f":"SUM(AE11:AE13)","v":100},"%",null,false,0,0,0,0,0,0]
[null,21,{"$nulls":4},5,{"$f":"IF($R$4=1,1,0)","v":0},"C",null,0,"0 %",20,"","80 %",null,0,5,0,5,null,0,"",28,"",{"$nulls":8},false,0,0,0,0,0,0]
[null,20,"x",{"$nulls":3},5,{"$f":"IF($R$4=1,0,1)","v":1},"C",null,1,"4 %",24,"%","76 %",null,5,5,0,6,null,6,"%",34,"%",{"$nulls":8},false,0,0,1,0,0,0]
[null,19,{"$nulls":4},5,{"$f":"IF($R$4=1,1,0)","v":0},"C",null,0,"0 %",24,"","76 %",null,0,5,5,6,null,0,"",34,"",{"$nulls":8},false,0,0,0,0,0,0]
[null,18,"xxx",{"$nulls":3},4.5,{"$f":"IF($R$4=1,0,1)","v":1},"D",null,3,"13 %",37,"%","63 %",null,13.5,4.5,0,9,null,17,"%",51,"%",{"$nulls":8},false,0,0,0,3,0,0]
[null,17,{"$nulls":4},4.5,{"$f":"IF($R$4=1,1,0)","v":0},"D",null,0,"0 %",37,"","63 %",null,0,4.5,0,9,null,0,"",51,"",{"$nulls":8},false,0,0,0,0,0,0]
[null,16,"xx",{"$nulls":3},4.5,{"$f":"IF($R$4=1,0,1)","v":1},"D",null,2,"8 %",45,"%","55 %",null,9,4.5,0,11,null,11,"%",62,"%",{"$nulls":8},false,0,0,0,2,0,0]
[null,15,"xxx",{"$nulls":3},4.5,{"$f":"IF($R$4=1,1,0)","v":0},"D",null,3,"13 %",58,"%","42 %",null,13.5,4.5,4.5,14,null,17,"%",79,"%",{"$nulls":8},false,0,0,0,3,0,0]
[null,14,{"$nulls":4},4,{"$f":"IF($R$4=1,0,1)","v":1},"E",null,0,"0 %",58,"","42 %",null,0,4,0,14,null,0,"",79,"",{"$nulls":8},false,0,0,0,0,0,0]
[null,13,{"$nulls":4},4,{"$f":"IF($R$4=1,1,0)","v":0},"E",null,0,"0 %",58,"","42 %",null,0,4,0,14,null,0,"",79,"",{"$nulls":8},false,0,0,0,0,0,0]
[null,12,"xxxx",{"$nulls":3},4,{"$f":"IF($R$4=1,0,1)","v":1},"E",null,4,"17 %",75,"%","25 %",null,16,4,0,18,null,22,"%",101,"%",{"$nulls":8},false,0,0,0,0,4,0]
[null,11,{"$nulls":4},4,{"$f":"IF($R$4=1,1,0)","v":0},"E",null,0,"0 %",75,"","25 %",null,0,4,4,18,null,0,"",101,"",{"$nulls":8},false,0,0,0,0,0,0]
[null,10,"xx",{"$nulls":3},3.5,{"$f":"IF($R$4=1,0,1)","v":1},"F",null,2,"8 %",83,"%","17 %",null,7,3.5,0,20,null,"","%",0,"%",{"$nulls":8},false,0,0,0,0,0,2]
[null,9,{"$nulls":4},3.5,{"$f":"IF($R$4=1,1,0)","v":0},"F",null,0,"0 %",83,"","17 %",null,0,3.5,3.5,20,null,"","",0,"",{"$nulls":8},false,0,0,0,0,0,0]
[null,8,"xx",{"$nulls":3},3,{"$f":"IF($R$4=1,0,1)","v":1},"F",null,2,"8 %",91,"%","9 %",null,6,3,0,22,null,"","%",0,"%",{"$nulls":8},false,0,0,0,0,0,2]
[null,7,{"$nulls":4},3,{"$f":"IF($R$4=1,1,0)","v":0},"F",null,0,"0 %",91,"","9 %",null,0,3,3,22,null,"","",0,"",{"$nulls":8},false,0,0,0,0,0,0]
[null,6,"xx",{"$nulls":3},2.5,{"$f":"IF($R$4=1,0,1)","v":1},"F",null,2,"8 %",99,"%","1 %",null,5,2.5,0,24,null,"","%",0,"%",{"$nulls":8},false,0,0,0,0,0,2]
[null,5,{"$nulls":4},2.5,{"$f":"IF($R$4=1,1,0)","v":0},"F",null,0,"0 %",99,"","1 %",null,0,2.5,2.5,24,null,"","",0,"",{"$nulls":8},false,0,0,0,0,0,0]
[null,4,{"$nulls":4},2,{"$f":"IF($R$4=1,0,1)","v":1},"F",null,0,"0 %",99,"","1 %",null,0,2,0,24,null,"","",0,"",{"$nulls":8},false,0,0,0,0,0,0]
[null,3,{"$nulls":4},2,{"$f":"IF($R$4=1,1,0)","v":0},"F",null,0,"0 %",99,"","1 %",null,0,2,2,24,null,"","",0,"",{"$nulls":8},false,0,0,0,0,0,0]
[null,2,{"$nulls":4},1.5,{"$f":"IF($R$4=1,0,1)","v":1},"F",null,0,"0 %",99,"","1 %",null,0,1.5,0,24,null,"","",0,"",{"$nulls":8},false,0,0,0,0,0,0]
[null,1,{"$nulls":4},1.5,{"$f":"IF($R$4=1,1,0)","v":0},"F",null,0,"0 %",99,"","1 %",null,0,1.5,1.5,24,null,"","",0,"",{"$nulls":8},{"$f":"ISERROR(I35)","v":false},0,0,0,0,0,0]
[null,0,{"$nulls":4},1,{"$f":"IF($R$4=1,0,1)","v":1},"F",null,0,"0 %",99,"","1 %",null,0,1,0,24,null,"","",0,"",{"$nulls":8},false,0,0,0,0,0,0]
[null,-1,{"$nulls":4},1,{"$f":"IF($R$4=1,1,0)","v":0},"F",null,0,"0 %",99,"","1 %",null,0,1,{"$error":"#N/A"},24,null,"","",0,"",{"$nulls":8},false,0,0,0,0,0,0]
[null,-2,{"$nulls":4},{"$error":"#N/A"},{"$f":"IF($R$4=1,0,1)","v":1},{"$error":"#N/A"},null,0,"0 %",99,"","1 %",null,0,{"$error":"#N/A"},{"$error":"#N/A"},24,null,{"$error":"#N/A"},"",{"$error":"#N/A"},"",{"$nulls":8},{"$f":"ISERROR(I38)","v":true},0,0,0,0,0,0]
[null,-3,{"$nulls":4},{"$error":"#N/A"},{"$f":"IF($R$4=1,1,0)","v":0},{"$error":"#N/A"},null,0,"0 %",99,"","1 %",null,0,{"$error":"#N/A"},{"$error":"#N/A"},24,null,{"$error":"#N/A"},"",{"$error":"#N/A"},"",{"$nulls":8},{"$f":"ISERROR(I39)","v":true},0,0,0,0,0,0]
[null,-4,{"$nulls":4},{"$error":"#N/A"},{"$f":"IF($R$4=1,0,1)","v":1},{"$error":"#N/A"},null,0,"0 %",99,"","1 %",null,0,{"$error":"#N/A"},{"$error":"#N/A"},24,null,{"$error":"#N/A"},"",{"$error":"#N/A"},"",{"$nulls":8},true,0,0,0,0,0,0]
{"$rows_left_out":68}
{"sheet":"Conversions","index":2,"n_rows":45,"n_cols":14,"rows_kept":45,"merged":[[43,0,43,6]]}
[]
[{"$nulls":7},"Max :",{"$f":"Echelle!F9","v":6},{"$f":"IF(I2<11,1,2)","v":1}]
[null,"Lettres",{"$nulls":3},"Lettres2",null,null,">6","A",null,">10","B"]
[null,0,"F",null,null,{"$f":"IF($J$2=1,I4,L4)","v":0},"F",null,0,"F",null,0,"F"]
[null,1.5,"F",null,null,{"$f":"IF($J$2=1,I5,L5)","v":0},"F",null,0,"F",null,0,"F"]
[null,1,"F",null,null,0,"F",null,0,"F",null,0,"F"]
[null,1.5,"F",null,null,0,"F",null,0,"F",null,0,"F"]
[null,2,"F",null,null,0,"F",null,0,"F",null,0,"F"]
[null,2.5,"F",null,null,0,"F",null,0,"F",null,0,"F"]
[null,3,"F",null,null,0,"F",null,0,"F",null,0,"F"]
[null,3.5,"F",null,null,0,"F",null,0,"F",null,0,"F"]
[null,4,"E",null,null,6,"E",null,6,"E",null,10,"E"]
[null,4.5,"D",null,null,6.5,"D",null,6.5,"D",null,11,"D"]
[null,5,"C",null,null,7.5,"C",null,7.5,"C",null,13,"C"]
[null,5.5,"B",null,null,8.5,"B",null,8.5,"B",null,15,"B"]
[null,6,"A",null,null,9.5,"A",null,9.5,"A",null,17,"A"]
[]
[{"$nulls":3},"Tabelle des échelles de notation"]
[]
[{"$nulls":3},"Ancienne échelle EPFL sur 10 ","Echelle EPFL utilisée passage notation de 10 à 6","Echelle ECTS (European Credits Transfer System)","Echelle Lettres USA","Echelle Ulowa","France"]
[{"$nulls":10},"Note","meilleurs    /suivant","Mention","Définition"]
[{"$nulls":3},10,6,"A","A+",null,"18-20 ",null,"A","10 %","Excellent","Résultats remarquables, avec seulement quelques insuffisances mineures"]
[{"$nulls":3},9.5,5.75,"A","A+",4.33,17]
[{"$nulls":3},9,5.5,"B","A ",{"v":4,"d":"4.00"},16,null,"B","25 %","Très bien","Résultats supérieurs à la moyenne, malgré un certain nombre d'insuffisances"]
[{"$nulls":3},8.5,5.25,"B","A-",3.67,15]
[{"$nulls":3},8,5,"C","B+",3.33,14,null,"C","30 %","Bien","Généralement bon, malgré un certain nombre d'insuffisances notables"]
[{"$nulls":3},7.5,4.75,"C","B ",{"v":3,"d":"3.00"},13]
[{"$nulls":3},7,4.5,"D","B-",2.67,12,null,"D","25 %","Satisfaisant","Travail honnête, mais comportant des lacunes importantes"]
[{"$nulls":3},6.5,4.25,"D","C+",2.33,11]
[{"$nulls":3},6,4,"E","C ",{"v":2,"d":"2.00"},10,null,"E","10 %","Passable","Les résultats satisfont aux critères minimaux"]
[{"$nulls":3},5.5,3.75,"F","C-",1.67,9]
[{"$nulls":3},5,3.5,"F","D+",1.33,8,null,"FX",null,"Insuffisant","Un travail supplémentaire est nécessaire pour l'octroi d'un crédit"]
[{"$nulls":3},4.5,3.25,"F","D",{"v":1,"d":"1.00"},7]
[null,{"$f":"Echelle!B42","v":""},{"$f":"Echelle!C42","v":""},4,3,"F","D-",0.67,6,null,"F",null,"Insuffisant","Un travail supplémentaire considérable est nécessaire"]
[null,{"$f":"Echelle!B43","v":""},{"$f":"Echelle!C43","v":""},3.5,2.75,"F","F",{"v":0,"d":"0.00"},5]
[null,{"$f":"Echelle!B44","v":""},{"$f":"Echelle!C44","v":""},3,2.5,"F",null,null,5]
[null,{"$f":"Echelle!B45","v":""},{"$f":"Echelle!C45","v":""},2.52,2.25,"F",null,null,4]
[null,{"$f":"Echelle!B46","v":""},{"$f":"Echelle!C46","v":""},2,2,"F",null,null,3]
[null,{"$f":"Echelle!B47","v":""},{"$f":"Echelle!C47","v":""},1.5,1.75,"F",null,null,2]
[null,{"$f":"Echelle!B48","v":""},{"$f":"Echelle!C48","v":""},1,1.5,"F",null,null,1]
{"$rows_left_out":5}