{"text_format":"1","workbook":"xlsx","n_sheets":6,"sheets":["Accueil","Jeu transitoires","Résumé théorie","Dessins de l'aide","Données","Dessins"],"not_rendered":{"charts":0,"images":22,"macros":1,"external_links":0,"defined_names":5,"comments":0,"pivot_tables":0},"unopened":[],"bounds":{"document_bytes":16777216,"sheet_cells":100000,"rows_first":2000,"rows_last":500,"rows_between":2000,"halvings":0,"cell_chars":16384,"cell_head_chars":4096},"cells_cut":0,"cells_raw":0,"read":"whole","date_system":"1900"}

{"sheet":"Accueil","index":0,"n_rows":81,"n_cols":10,"rows_kept":81,"cut":false,"hidden":false,"merged":[[80,2,80,6],[1,1,1,16],[73,5,75,7],[16,2,18,6],[20,2,22,2],[25,2,28,2],[25,3,29,6],[20,3,23,6]]}
[]
[null,"Entraînement sur l'ajustement des comptes de gestion"]
[]
[null,null,null,null,null,null,"Les opérations de régulation de fin d'année sont plus"]
[null,null,null,null,null,null,"complexes qu'il n'y paraît."]
[]
[null,null,null,null,null,null,"Bien qu'elles reposent sur une pure logique, des comptes"]
[null,null,null,null,null,null,"d'Actifs ou de Passifs qui s'appellent Charges quelque chose "]
[null,null,null,null,null,null,"ou Produits quelque chose créent la confusion chez les néophytes."]
[]
[null,null,null,null,null,null,"De plus, le fait que la terminologie varie d'un manuel à l'autre"]
[null,null,null,null,null,null,"n'arrange rien !"]
[]
[]
[]
[]
[null,null,"Ce programme d'entraînement, d'une cinquantaine de questions, a pour principaux objectifs  :"]
[]
[]
[]
[null,null," -","de faire réfléchir sur la réalité économique des ajustements et d'en maîtriser la logique comptable et arithmétique."]
[]
[]
[]
[]
[null,null," -","de se forcer à se situer dans le temps. (A tel moment de la comptabilité on fait ceci…à tel autre on fait cela...)"]
[]
[]
[]
[]
[]
[]
[]
[]
[]
[]
[]
[]
[]
[]
[]
[]
[null,null,null,null,null,null,null,null,100,"Faire en sorte que le cadre ci-dessus occupe tout l'écran"]
[]
[]
[]
[]
[null,null,null,null,null,null,null,null,null,"Mode d'emploi de la feuille d'entraînement : "]
[]
[null,null,null,null,null,null,null,null,null,"a) Réglages :"]
[null,null,null,null,null,null,null,null,null,"     - Zoom pour l'écran (Entrer le % désiré puis Bouton \"Zoom\";"]
[null,null,null,null,null,null,null,null,null,"        agit sur les quatre feuilles)                          "]
[null,null,null,null,null,null,null,null,null,"     - Choisir la terminologie selon le manuel utilisé."]
[null,null,null,null,null,null,null,null,null,"      "]
[null,null,null,null,null,null,null,null,null,"b) Tirage d'une question :"]
[null,null,null,null,null,null,null,null,null,"     - soit avec la toupie pour avancer ou reculer d'une question"]
[null,null,null,null,null,null,null,null,null,"     - soit manuellement (entrer un nombre entre 1 et 53 en L18)"]
[null,null,null,null,null,null,null,null,null,"     - soit par tirage au sort"]
[null,null,null,null,null,null,null,null,null,"       Changer de question ne pénalise pas !"]
[]
{"$rows_left_out":22}
{"sheet":"Jeu transitoires","index":1,"n_rows":41,"n_cols":22,"rows_kept":41,"cut":false,"hidden":false,"merged":[[30,10,30,14],[0,0,0,12],[7,1,7,2],[1,1,1,5],[1,7,1,11],[2,1,2,2],[2,4,2,5],[2,7,2,8],[2,10,2,11],[17,2,18,10],[2,17,2,20],[17,11,18,11],[10,1,10,5],[10,7,10,11],[11,1,11,2],[11,4,11,5],[11,7,11,8],[11,10,11,11],[7,11,9,11],[8,3,8,4]]}
["Entraînement sur l'ajustement des comptes de gestion"]
[null,{"$f":"VLOOKUP(5,Nomencla,$S$10+1)","v":"Actif de régulation (A de R)"},null,null,null,null,null,{"$f":"VLOOKUP(6,Nomencla,$S$10+1)","v":"Passif de régulation (P de R)"}]
[null,{"$f":"VLOOKUP(1,Nomencla,$S$10+1)","v":" + Char. enregistrées d'avance"},null,null,{"$f":"VLOOKUP(2,Nomencla,$S$10+1)","v":" + Prod. à enregistrer"},null,null,{"$f":"VLOOKUP(3,Nomencla,$S$10+1)","v":" - Char. à enregistrer"},null,null,{"$f":"VLOOKUP(4,Nomencla,$S$10+1)","v":" - Prod. enregistrés d'avance"},null,null,null,null,null,null,"Solution de la question et réponse du joueur :"]
[null,null,null,null,null,null,null,null,null,null,null,null,null,null,null,null,null,"Débit","Crédit","Montant","Période"]
[null,null,null,null,null,null,null,null,null,null,null,null,null,null,null,null,null,{"$f":"VLOOKUP($L$18,Données,3)","v":0},{"$f":"VLOOKUP($L$18,Données,4)","v":0},{"$f":"VLOOKUP($L$18,Données,5)","v":0},{"$f":"VLOOKUP($L$18,Données,6)","v":0}]
[null,null,null,null,null,null,null,null,null,null,null,null,null,null,null,null,null,false,false,false,false,{"$f":"SUM(R6:U6)","v":0}]
[]
[null,"Période de l'opération :",null,null,null,null,null,null,null,null,"Aides",null,null,null,null,null,null,"Période choisie",5,"Aide"]
[null,null,null,{"$f":"\"     \"&$S$24","v":"     2016"},null,"   Clôture",null,"  Ouverture",{"$f":"\"       \"&S27","v":"       2017"},null,null,null,null,null,null,null,null,"Commentaire","Nomencla","Masque","Dessin","Voir solution"]
[null,null,null,null,null,null,null,null,null,null,{"$f":"IF(T10=FALSE,\"\",IF(S8=0,\"Choisir la période\",\"\"))","v":""},null,null,null,null,null,null,true,4,false,{"$f":"IF(T12=TRUE,VLOOKUP($L$18,Données,7),0)","v":0},true]
[null,"Comptes de Gestion",null,null,null,null,null,{"$f":"VLOOKUP(8,Nomencla,$S$10+1)","v":"Autres comptes du Bilan"},null,null,null,null,null,null,null,null,null,2,null,"Image"]
[null," + Charges diverses -",null,null,"  - Produits divers +",null,null," + Actifs divers -",null,null," - Passifs divers +",null,null,null,null,null,null,null,null,false]
[null,null,null,null,null,null,null,null,null,null,null,null,null,null,null,null,null,"Somme saisie","Pour voir si","masque 52 (Tr)",{"$f":"IF(V13=1,\"en bas\",\"en haut\")","v":"en bas"},1]
[null,null,null,null,null,null,null,null,null,null,null,null,null,null,null,null,null,{"$f":"SUM(B5:L5)+SUM(B14:L14)","v":0},"saisie","masque 55 (Bi)",{"$f":"IF(V14=1,\"en bas\",\"en haut\")","v":"en bas"},1]
[]
[null,null,null,null,null,null,null,null,null,null,null,null,null,null,null,null,null,"Tirage toupie","Solution en clair"]
[]
[null,"Question :",{"$f":"VLOOKUP(L18,Données,2)","v":"    N o u v e l l e   p a r t i e"},null,null,null,null,null,null,null,null,0,null,null,null,null,null,0,{"$f":"VLOOKUP($L$18,Solutions,2)","v":{"$error":"#N/A"}},{"$f":"VLOOKUP($L$18,Solutions,3)","v":{"$error":"#N/A"}},{"$f":"VLOOKUP($L$18,Solutions,4)","v":{"$error":"#N/A"}},{"$f":"VLOOKUP($L$18,Solutions,5)","v":{"$error":"#N/A"}}]
[]
[]
[null,"Montant :",null,{"$f":"IF(C21=0,\"Enter pour valider\",IF(S8=0,\"Choisir la période\",IF(R14=C21*2,\"\",\"Cliquer sur le débit d'un compte et le crédit d'un autre\")))","v":"Enter pour valider"}]
[null,null,null,null,null,null,null,null,null,null,null,null,null,null,null,null,null,"Calendrier",{"$f":"NOW()","v":"2016-03-12T00:35:31.550"}]
[null,null,null,null,null,null,null,null,null,"Tirez une question ici !",null,null,{"$f":"IF(J23=\"B r a v o !\",\"\",IF(G23=\"\",\"\",\"3 points perdus !\"))","v":""},null,null,null,null,0,"?"]
[null,null,null,null,null,null,null,null,null,"Question ...",null,null,null,null,null,null,null,1,{"$f":"YEAR(S22)","v":2016}]
[null,null,"Evaluation :",null,null,null,null,null,null,null,null,null,null,null,null,null,null,2,{"$f":"\"31.12.\"&RIGHT(S24,2)","v":"31.12.16"}]
[null,null,null,null,null,null,null,null,null,null,null,null,null,null,null,null,null,3,{"$f":"\"1.1.\"&RIGHT(S27,2)","v":"1.1.17"}]
[null,null,null,null,null,null,null,null,null,null,null,null,null,null,null,null,null,4,{"$f":"S24+1","v":2017}]
[null,null,"Nb. réponses :",null,"Points :",null,null,"Note sur 6 :",null,null,null,null,null,null,null,null,null,5," "]
[null,null,null,null,null,null,{"$f":"IF(G28=\"\",\"\",\"aides\")","v":""},null,null,null,null,null,null,null,null,null,null,"test :",{"$f":"VLOOKUP(S8,R23:S28,2)","v":" "}]
[]
[null," ",null,null,null,null,null,null,null,null,"© Y. Péguiron - www.infodidac.ch - rév. 08.03.2016"]
[]
[]
[null,null,null,null,"Ctrl + s permet de voir la solution, mais attention, cela vous en coûtera 3 points ! (Sauf si, histoire de voir, vous avezdéjà répondu juste à la question)"]
[null,null,null,null,"La corbeille permet d'annuler la première saisie dans les comptes ! (ça ne coûte rien !)"]
[null,null,null,null,"Aides (5 aides pour le prix d'un point)"]
[null,null,null,null,"1) Image : Montre symboliquement l'opération - Un clic sur l'image d'aide renvoie  vers les explications des dessins (Feuille \"Dessins de l'aide\")."]
[null,null,null,null,"2) Masque : La catégorie de comptes qui ne doivent pas être touchés est masquée. (Ne dépend pas de la question, mais de votre sélection de période)"]
[]
[]
["Zoom :",100]

{"sheet":"Résumé théorie","index":2,"n_rows":61,"n_cols":9,"rows_kept":61,"cut":false,"hidden":false,"merged":[[32,5,32,7],[33,5,34,7],[0,1,0,9],[30,5,31,7]]}
[null,"Ajustement des comptes de gestion"]
[null,"Un exercice comptable se doit de présenter la réalité économique de la période qu'il couvre (souvent l'année civile"]
[null,"  du 1er janvier au 31 décembre)."]
[]
[null,"Les produits et les charges sont obligatoirement comptabilisés au moment du flux financier, or le moment du "]
[null,"  paiement ne représente pas nécessairement la réalité temporelle et économique de l'événement. "]
[null,"  Le règlement d'un loyer en décembre peut concerné le mois de janvier, par exemple."]
[]
[null,"Cas échéant, au moment de la clôture, il faudra procéder à des corrections (écritures correctives) et faire transiter"]
[null,"  (d'où le mot transitoire) la charge ou le produit mal placé d'une  année vers l'autre."]
[]
[null,"Il y a quatre cas de figure possibles :"]
[null,null,"1) Une charge qui concerne l'exercice suivant a été payée par avance pendant l'année en cours."]
[null,null,"2) Une charge de l'année en cours n'a pas encore été payée et sera réglée l'année suivante. Or on tient à ce"]
[null,null,"     que cette charge influence le résultat cette année."]
[null,null,"3) Un produit de l'année en cours n'a pas encore été encaissé et l'on veut absolument en tenir compte cette année."]
[null,null,"4) Un produit qui concerne l'année suivante est déjà encaissé pendant l'exercice en cours et il faut bien"]
[null,null,"     le sortir de cet exercice qui  n'est pas le sien."]
[null,"  Evidemment des charges ou des produits peuvent chevaucher deux exercices; il conviendra alors "]
[null,"  de les répartir judicieusement entre les deux années."]
[]
[null,"Etant donné que les comptes de gestion (Charges et Produits) disparaissent au bouclement, lors de leur virement à "]
[null,"  \"Résultat\", il faudra nécessairement passer par le Bilan pour faire le transit. (Voir le camion ci-dessous !)"]
[]
[null,"Les comptes du Bilan créés pour faire ce transit sont éphémères, comme certains papillons, ils ne vivront qu'une nuit !"]
[null,"   Ainsi, ces comptes transitoires seront créés uniquement pour la clôture puis ils seront annulés (extournés)"]
[null,"   juste après la réouverture des comptes l'année suivante."]
[]
[null,"Généralement on utilise 4 comptes correctifs pour ce travail de transition; 2 comptes d'Actif et 2 comptes de Passif :"]
[]
[null,null,null,null,null,{"$f":"'Jeu transitoires'!B2","v":"Actif de régulation (A de R)"},null,null,{"$f":"'Jeu transitoires'!B3","v":" + Char. enregistrées d'avance"}]
[null,null,null,null,null,null,null,null,{"$f":"'Jeu transitoires'!E3","v":" + Prod. à enregistrer"}]
[null,null,null,null,null,{"$f":"VLOOKUP(7,Nomencla,'Jeu transitoires'!$S$10+1)","v":"Comptes de régulation"}]
[null,null,null,null,null,{"$f":"'Jeu transitoires'!H2","v":"Passif de régulation (P de R)"},null,null,{"$f":"'Jeu transitoires'!H3","v":" - Char. à enregistrer"}]
[null,null,null,null,null,null,null,null,{"$f":"'Jeu transitoires'!K3","v":" - Prod. enregistrés d'avance"}]
[]
[]
[]
[]
[]
[]
[]
[]
[]
[]
[]
[]
[]
[]
[]
[]
[]
[]
[]
[]
[]
[]
[null,"Exemple : "]
[null,null,"Une charge payée d'avance "]
[null,null,"Un produit reçu d'avance"]
{"$rows_left_out":2}
{"sheet":"Dessins de l'aide","index":3,"n_rows":38,"n_cols":7,"rows_kept":38,"cut":false,"hidden":false,"merged":[[10,4,10,7],[3,3,9,3],[1,1,1,8],[2,4,2,5],[2,6,2,7],[3,4,4,5],[7,6,9,7]]}
[]
[null,"Signification des dessins de l'aide"]
[null,null,null,null,{"$f":"\"Année \"&'Jeu transitoires'!S24","v":"Année 2016"},null,{"$f":"\"Année \"&'Jeu transitoires'!S27","v":"Année 2017"}]
[null,null,null,null,{"$f":"\"Flux financier en \"&'Jeu transitoires'!S24","v":"Flux financier en 2016"}]
[]
[]
[]
[null,null,null,null,null,null,{"$f":"\"Flux financier en \"&'Jeu transitoires'!S27","v":"Flux financier en 2017"}]
[]
[]
[null,null,null,null," Comptes  de  gestion"]
[null,null,null,"Passif"]
[null,null,null,{"$f":"'Jeu transitoires'!$K$3","v":" - Prod. enregistrés d'avance"}," Produits",null," Produits"]
[]
[]
[null,null,null,"Actif"]
[null,null,null,{"$f":"'Jeu transitoires'!$E$3","v":" + Prod. à enregistrer"}," Produits",null," Produits"]
[]
[]
[null,null,null,"Actif"]
[null,null,null,{"$f":"'Jeu transitoires'!$B$3","v":" + Char. enregistrées d'avance"},"Charges",null,"Charges"]
[]
[]
[null,null,null,"Passif"]
[null,null,null,{"$f":"'Jeu transitoires'!$H$3","v":" - Char. à enregistrer"},"Charges",null,"Charges"]
[]
[]
[]
[null,null,null,"Extourne  à la réouverture des comptes"]
[]
[]
[]
[]
[]
[]
[]
[]
[null,"Terminologie selon le choix défini dans la feuille de jeu"]

{"sheet":"Données","index":4,"n_rows":72,"n_cols":27,"rows_kept":72,"cut":false,"hidden":true,"merged":[[4,21,4,22],[4,23,4,24],[4,25,4,26],[0,19,0,22],[0,23,0,26],[3,19,3,22],[3,23,3,26],[1,19,1,20],[1,21,1,22],[1,23,1,24],[1,25,1,26],[3,2,3,3],[3,4,3,5],[0,2,0,3],[0,4,0,5],[4,19,4,20]]}
["Données",null,"Actif transitoire",null,"Passif transitoire",null,null,"dessin",null,null,"Nomenclature - Terminologie",null,null,null,null,null,null,null,"Statistiques","Actif transitoire",null,null,null,"Passif transitoire"]
[null,null,"Ch. p. d'av","Pr. à rec","Ch. à payer","Pr. reçu d'av"," fin d'année     = 1","1 Produit PRA",null,"Nomencla","VLE","PME","Anciens","Initiation VP","No",null,null,null,null,"Ch. p. d'av",null,"Pr. à rec",null,"Ch. à payer",null,"Pr. reçu d'av"]
[null,null," 1   |   2"," 3   |   4"," 5   |   6"," 7   |   8"," 31 décembre  = 2","2 Produit PAR",null,1," + Charges payées d'avance -"," + Ch. constatées d'avance -"," + Charges payées d'avance -"," + Char. enregistrées d'avance","  1300   CPA  ",null,null,null,null,{"$f":"COUNTIF($C$12:$D$72,\"=1\")","v":9},{"$f":"COUNTIF($C$12:$D$72,\"=2\")","v":4},{"$f":"COUNTIF($C$12:$D$72,\"=3\")","v":6},{"$f":"COUNTIF($C$12:$D$72,\"=4\")","v":4},{"$f":"COUNTIF($C$12:$D$72,\"=5\")","v":2},{"$f":"COUNTIF($C$12:$D$72,\"=6\")","v":6},{"$f":"COUNTIF($C$12:$D$72,\"=7\")","v":2},{"$f":"COUNTIF($C$12:$D$72,\"=8\")","v":4}]
[null,null,"Gestion",null,"Situation",null," 1er janvier      = 3","3 Charge CPA",null,2," + Produits à recevoir -"," + Produits à recevoir -"," + Produits à recevoir -"," + Prod. à enregistrer","  1301   PAR  ",null,null,null,null,"Gestion",null,null,null,"Situation"]
[null,null,"Charges","Produits","Autres actifs","Autres passifs"," début d'année = 4","4 Charge CAP",null,3," - Charges à payer +"," - Charges à payer +"," - Charges à payer +"," - Char. à enregistrer","  2300   CAP  ",null,null,null,null,"Charges",null,"Produits",null,"Autres actifs",null,"Autres passifs"]
[null,null," 11  |  12"," 13  |  14","  15  |  16"," 17  |  18",null,"5 Produit PRA",null,4," - Produits reçus d'avance +"," - Pr. constatés d'avance +"," - Produits encaissés d'avance +"," - Prod. enregistrés d'avance","  2301   PRA  ",null,null,null,null,{"$f":"COUNTIF($C$12:$D$72,\"=11\")","v":17},{"$f":"COUNTIF($C$12:$D$72,\"=12\")","v":13},{"$f":"COUNTIF($C$12:$D$72,\"=13\")","v":9},{"$f":"COUNTIF($C$12:$D$72,\"=14\")","v":14},{"$f":"COUNTIF($C$12:$D$72,\"=15\")","v":7},{"$f":"COUNTIF($C$12:$D$72,\"=16\")","v":8},{"$f":"COUNTIF($C$12:$D$72,\"=17\")","v":1},{"$f":"COUNTIF($C$12:$D$72,\"=18\")","v":0}]
[null,null,null,null,null,null,null,"6 Produit PAR","Extourne + 10",5,"Actifs transitoires","Actifs de régulation","Actifs transitoires","Actif de régulation (A de R)","  130  AT  "]
[{"$f":"COUNTA(A12:A112)","v":53},"libellé","débit","crédit","montant","date","dessin","7 Charge CPA",null,6,"Passifs transitoires","Passifs de régulation","Passifs transitoires","Passif de régulation (P de R)","  230  PT  "]
[0,"    N o u v e l l e   p a r t i e",null,null,null,null,null,"8 Charge CAP",null,7,"Comptes transitoires","Comptes de régulation","Comptes correctifs","Comptes de régulation","Transitoires"]
[null,null,null,null,null,null,null,"9 & 10 Bourse",null,8,"Autres comptes du Bilan","Autres comptes de situation","Autres comptes du Bilan","Autres comptes du Bilan","Autres comptes du Bilan"]
[null,null,null,null,null,null,null,null,"Solutions"]
[1,"Notre locataire M. Skuatt n'a pas encore payé son loyer de décembre,   CHF 1'500.-. Comptabiliser le transitoire.",3,14,1500,2,6,1,"AT (PAR)","Pr. Immeuble",{"$f":"E12","v":1500},{"$f":"F12","v":2}]
[2,"Intérêts hypothécaires courus 3 mois à 4% / 500000.-",11,6,5000,2,8,2,"Ch. Immeuble","PT (CAP)",5000,2]
[3,"Payé le loyer du dépôt pour décembre, janvier et février - CHF 4'500.-",11,16,4500,1,9,3,"Loyer","Caisse",4500,1]
[4,"Fin novembre, nous avions payé CHF 4'500.- de loyer du dépôt pour décembre, janvier et février - Faire l'écriture corrective.",1,12,3000,2,3,4,"AT (CPA)","Loyer",3000,2]
[5,"A la clôture, nous avions corrigé le loyer du dépôt payé 4'500.- pour décembre, janvier, février - Extournez cette écriture !",11,2,3000,3,13,5,"Loyer","AT (CPA)",3000,3]
[6,"Notre locataire M. Skuatt n'avait pas payé son loyer de décembre, CHF 1'500.-. Un transitoire a été comptabilisé le 31 décembre. Extournez-le !",13,4,1500,3,16,6,"Pr. Immeuble","AT (PAR)",1500,3]
[7,"Notre locataire, M. Skuatt a payé son loyer de décembre le 15 janvier. - CHF 1'500.-",15,14,1500,4,10,7,"Caisse","Pr. Immeuble",1500,4]
[8,"Payé le 12 décembre l'abonnement à 24H. pour l'année prochaine. - CHF 375.-",11,16,375,1,9,8,"ACE","Caisse",375,1]
[9,"Nous avions payé en décembre l'abonnement annuel à 24H. Faire en sorte que cette charge de CHF 375.- soit reportée entièrement sur l'année prochaine.",1,12,375,2,7,9,"AT (CPA)","ACE",375,2]
[10,"Le 30 septembre nous avions accordé un prêt de 50'000. à M. Fauchez, au taux de 6%. Il paiera les intérêts le 30 septembre prochain. Enregistrer la part d'intérêts qui concerne cette année.",3,14,750,2,2,10,"AT (PAR)","Prod. Fin.",750,2]
[11,"Suite à des dégâts d'eau, la Vaudoise Assurances nous doit CHF 4'000.- qu'elle paiera en janvier. Comptabiliser le transitoire.",3,14,4000,2,6,11,"AT (PAR)","Prod. Except.",4000,2]
[12,"Nous avions passé en transitoire une indemnité de CHF 4'000.- due par la Vaudoise Assurances pour des dégâts d'eau. Extourner maintenant l'écriture corrective du 31 décembre.",13,4,4000,3,16,12,"Prod. Except.","AT (PAR)",4000,3]
[13,"Le 25 janvier, La Vaudoise Assurance nous verse l'indemnité de CHF 4'000.- due suite aux dégâts d'eau de l'été passé.",15,14,4000,4,10,13,"Poste","Prod. Excep.",4000,4]
[14,"Nous n'avons pas encore reçu la facture pour la réparation d'une machine. Nous l'évaluons à CHF 1'200.- pour l'opération transitoire.",11,6,1200,2,8,14,"ACE","PT (CAP)",1200,2]
[15,"Nous avons reçu le 5 février la facture pour la réparation de la machine. Nous la payons de suite par virement postal. CHF 1'100.-.",11,16,1100,4,10,15,"ACE","Poste",1100,4]
[16,"Le 15 novembre nous achetons au comptant des fournitures de bureau pour CHF 3'000.-",11,16,3000,1,9,16,"ACE","Caisse",3000,1]
[17,"En fin d'exercice nous constatons que nous n'avons utilisé que le 1/3 du stock de fournitures de bureau que nous avions payé CHF 3'000.-.",1,12,2000,2,3,17,"AT (CPA)","ACE",2000,2]
[18,"Extourner les 2/3 du stock de fournitures de bureau payés  CHF 3'000.-.",11,2,2000,3,13,18,"ACE","AT (CPA)",2000,3]
[19,"Le 30 octobre nous payons une prime d'assurance pour le semestre prochain. CHF 2'400.-",11,16,2400,1,9,19,"Assurance","Caisse",2400,1]
[20,"La prime d'assurance pour le semestre prochain a été payée fin octobre CHF 2'400.-. Comptabiliser le transitoire.",1,12,1600,2,3,20,"AT (CPA)","Assurance",1600,2]
[21,"Nous avions passé en transitoire la prime d'assurance semestrielle payée fin octobre CHF 2'400.-. Nous rouvrons la nouvelle comptabilité.",11,2,1600,3,13,21,"Assurance","AT (CPA)",1600,3]
[22,"Un voisin veut nous louer une machine début février prochain. Le 20 décembre il nous verse cash CHF 800.- pour la réservation.",15,14,800,1,9,22,"Caisse","Locations",800,1]
[23,"Un voisin nous avait versé CHF 800.- fin décembre pour réserver une machine que nous lui louerons en février. Passer cette recette sur l'exercice suivant.",13,8,800,2,5,23,"Locations","PT (PRA)",800,2]
[24,"Extournez le transitoire qui concernait l'avance de CHF 800.- que notre voisin a versée pour réserver une machine que nous lui  louerons en février.",7,14,800,3,15,24,"PT (PRA)","Locations",800,3]
[25,"L'abonnement CFF de notre représentant, d'une durée d'une année, est valable jusqu'au 31 mars prochain; il nous a coûté CHF 1'200.-. Répartir la charge prorata temporis sur les deux années.",1,12,300,2,3,25,"AT (CPA)","Frais transport",{"$f":"E36","v":300},{"$f":"F36","v":2}]
[26,"Nous évaluons la note de téléphone de décembre à CHF 350.-",11,6,350,2,8,26,"Téléphone","PT (CAP)",350,2]
[27,"Nous avions évalué la note de téléphone de décembre à CHF 350.-. Extourner cette écriture.",5,12,350,3,18,27,"PT (CAP)","Téléphone",350,3]
[28," Nous payons le 3 mars la note de téléphone de décembre CHF 380.-.",11,16,380,4,10,28,"Téléphone","Poste",380,4]
[29,"Le 25 novembre, la locataire, Mme Soussi paie sont loyer pour les 3 prochains mois, CHF 4'800.-.",15,14,4800,1,9,29,"Caisse","Pr. Immeuble",4800,1]
[30,"La locataire, Mme Soussi avait payé fin novembre 3 mois de loyer. Corriger sachant que le loyer mensuel est de CHF 1'600.-.",13,8,3200,2,1,30,"Pr. Immeuble","PT (PRA)",3200,2]
[31,"Extourner le transitoire passé pour les 3 mois de loyers payés par Mme Soussi fin novembre, CHF 4'800.-.",7,14,3200,3,11,31,"PT (PRA)","Pr. Immeuble",3200,3]
[32,"Nous avons effectué en décembre des travaux pour un montant de CHF 20'000.-. Ils n'ont pas encore été facturés aux clients. ",3,14,20000,2,6,32,"AT (PAR)","Travaux",20000,2]
[33,"Un fournisseur nous versera en mars prochain une ristourne (diminution de charges) de CHF 6'000.- sur nos achats. Les 4/5 concernent l'année écoulée.",3,12,4800,2,2,33,"AT (PAR)","Achats",4800,2]
[34,"Extourner l'écriture qui concernait la ristourne de CHF 6'000.- que notre fournisseur nous versera en mars prochain. Les 1/5 concernent la nouvelle année. (Charges -)",11,4,4800,3,12,34,"Achats","AT (PAR)",4800,3]
[35,"Nous avons reçu le 28 mars une note de crédit de CHF 6'000.- de notre fournisseur pour la ristourne promise. Les 4/5 concernaient l'année écoulée. (Diminution du prix d'achat)",17,12,6000,4,10,35,"Fournisseurs","Achats",6000,4]
[36,"Une facture de transport de marchandises achetées ne nous est pas encore parvenue. Nous l'estimons à CHF 300.-.",11,6,300,2,8,36,"Frais d'achat","PT (CAP)",300,2]
[37,"Des commissions, pour un montant de CHF 10'000.-, dues à des vendeurs externes seront payées en janvier prochain. (Ventes -)",13,6,10000,2,8,37,"Ventes","PT (CAP)",10000,2]
[38,"Le 15 janvier, nous payons par Poste CHF 10'000.- pour des commissions dues aux représentants sur leurs ventes de l'année écoulée. (Ventes -)",13,16,10000,4,10,38,"Ventes","Poste",10000,4]
[39,"Nous  encaissons le 15 décembre une subvention cantonale de CHF 1'500.- pour une campagne de prévention qui démarrera l'année prochaine.",15,14,1500,1,9,39,"Caisse","Prod. Except.",1500,1]
[40,"Nous avions encaissé le 15 décembre une subvention cantonale de CHF 1'500.- pour une campagne de prévention qui démarre en janvier. Corriger l'écriture.",13,8,1500,2,5,40,"Prod. Except.","PT (PRA)",1500,2]
[41,"En décembre, 80 heures supplémentaires à CHF 60.-/h. n'ont pas été payées. Elles le seront avec la paie de janvier.",11,6,4800,2,8,41,"Salaires","PT (CAP)",4800,2]
[42,"Extourner les CHF 4'800.- d'heures supplémentaires de décembre à payer en janvier.",5,12,4800,3,18,42,"PT (CAP)","Salaires",4800,3]
[43,"En fin d'année nous constatons qu'il reste encore 5'000 litres de mazout dans la citerne du dépôt. (Prix 70.- / 100 l.)",1,12,3500,2,7,43,"AT (CPA)","Ch. Immeuble",3500,2]
[44,"Le 23 décembre, nous consentons une avance de salaire de CHF 1'000.- à notre employé, M. Fauchex.",11,16,1000,1,9,44,"Salaires","Caisse",1000,1]
[45,"Passer en transitoire l'avance de salaire de CHF 1'000.- consentie fin décembre à notre employé dans la gêne.",1,12,1000,2,7,45,"AT (CPA)","Salaires",1000,2]
[46,"Extourner l'avance de salaire de CHF 1'000.- consentie à M. Fauchex.",11,2,1000,3,17,46,"Salaires","AT (CPA)",1000,3]
[47,"31 août, reçu par banque l'intérêt annuel d'un prêt de CHF 60'000.- accordé à un bon client M. Luc Ratiff. Taux 6%",15,14,3600,1,9,47,"Banque","Prod. financiers",3600,1]
[48,"Tenir compte de l'intérêt couru depuis le 31 août sur le prêt de CHF 60'000.- à 6 % accordé à notre client Luc Ratiff. ",3,14,1200,2,2,48,"AT (PAR)","Prod. financiers",1200,2]
[49,"A l'ouverture de notre comptabilité, nous régulons l'intérêt couru sur le prêt accordé à Luc Ratiff; CHF 1'200.-.",13,4,1200,3,12,49,"Prod. financiers","AT (PAR)",1200,3]
{"$rows_left_out":13}
{"sheet":"Dessins","index":5,"n_rows":1,"n_cols":1,"rows_kept":1,"cut":false,"hidden":true,"merged":[]}
["Dessins"]