{"text_format":"1","workbook":"xlsx","n_sheets":3,"sheets":["Quiz","Aide visuelle","Feuil2"],"not_rendered":{"charts":0,"images":116,"macros":1,"external_links":0,"defined_names":4,"comments":0,"pivot_tables":0},"unopened":[],"bounds":{"document_bytes":16777216,"sheet_cells":100000,"rows_first":2000,"rows_last":500,"rows_between":2000,"halvings":0,"cell_chars":16384,"cell_head_chars":4096},"cells_cut":0,"cells_raw":0,"read":"whole","date_system":"1900"}

{"sheet":"Quiz","index":0,"n_rows":99,"n_cols":17,"rows_kept":99,"cut":false,"hidden":false,"merged":[[3,3,4,3],[0,2,1,2],[3,2,4,2],[10,4,11,4]]}
[" ",null,null,{"$f":"I4","v":82},null,"<- Voir chien du menu"]
[null,null,null,{"$f":"I18","v":100},null,{"$f":"IF(J8=\"oui\",\"2 choix !\",\"\")","v":""}]
[null,null,null,null,null,null,null,null,null,null,null,null,null,null,null,{"$f":"IF(I20>275,E3,\"\")","v":""}]
[null,{"$f":"IF(I4>I7,\"\",VLOOKUP(I4,Feuil2!I21:M100,5))","v":""},{"$f":"IF(K5=0,\"\",IF(I8=\"oui\",\"P\",\"O\"))","v":""},"Répondre en cliquant sur le nom d'un chien. La gomme annule votre choix et libère le tirage. Les flèches du haut font simplement défiler les canidés sans attendre une réponse.",{"$f":"IF(I4=82,\"\",\"Taille : \"&VLOOKUP(I4,Feuil2!I21:J101,2)&\" cm - gr. \"&VLOOKUP(I4,Feuil2!A21:D100,4))","v":""},null,4,"Tirage / Menu",82,{"$f":"IF(J21=1,IF(I5=0,J6,I5),E4)","v":40}]
[null,{"$f":"IF(I4>I7,\"\",VLOOKUP(I4,Feuil2!I21:L100,3))","v":""},null,null,{"$f":"IF(I8=\"oui\",\"\",IF(OR(I21=1,I21=2),\"8\",\"?\"))","v":"8"},{"$f":"IF(I21>2,I16,\"\")","v":""},5,"Menu A /a+b",0,{"$f":"IF(I21=2,E4,SUM(I5:I6))","v":""},0]
[null,null,null,null,null,null,6,"Menu B ",0,{"$f":"I6+ 40","v":40},{"$f":"IF(I5=0,J6,I5)","v":40}]
[null,null,null,null,null,null,7,"nb chiens",80,0,{"$f":"\"< nouveau tirage\"","v":"< nouveau tirage"}]
[null,null,null,null,null,null,8,"Bonne réponse ",{"$f":"IF(I21=1,K35,IF(I4=J4,\"oui\",\"non\"))","v":"non"},{"$f":"IF(I5>0,IF(I6>0,\"oui\",\"non\"),\"non\")","v":"non"},"< gomme"]
[null,null," ",null,null,null,9,"Voir en défilant",false]
[null,null,null,null,null,null,10,"Voir stat / latin",false,false]
[null,null,null,null,null,null,11,"solution / famille",false,false]
[null,null,null,null,null,null,12,"nb rep",0,{"$f":"IF(INT((I12-I16)/5)<0,0,INT((I12-I16)/5))","v":0}]
[null,null,null,null,null,null,13,"nb juste",0,{"$f":"I13-I15","v":0}]
[null,null,null,null,null,null,14,"nb gomme",0,null,null,null,"     "]
[null,{"$f":"IF(I26=TRUE,\"Liste des tirages de cette partie :\",\"\")","v":""},null,null,null,null,15,"nb voir",0,null,null,null,null,"Lettres "]
[0,1,{"$f":"IF(A16=0,\"\",Q16&VLOOKUP(A16,Data,2))","v":""},null,null,null,16,"nb tir",0,100,null,null,null,null,{"$f":"IF(N16=\"\",\"\",N16&\" - \")","v":""},{"$f":"\"   (\"&A16&\")   -  \"","v":"   (0)   -  "},{"$f":"IF($I$21=1,O16,IF($I$21=4,P16,\"  \"))","v":"  "}]
[0,2,"",null,null,null,17,"évaluation",null,{"$f":"IF(I16=0,0,ROUND(J16*(I13-J12-J22)/(I16),0))","v":0},null,null,null,null,{"$f":"IF(N17=\"\",\"\",N17&\" - \")","v":""},{"$f":"\"   (\"&A17&\")   -  \"","v":"   (0)   -  "},{"$f":"IF($I$21=1,O17,IF($I$21=4,P17,\"  \"))","v":"  "}]
[0,3,"",null,null,null,18,"zoom",100,{"$f":"J17&\"/100\"","v":"0/100"},null,null,null,null,"","   (0)   -  ","  "]
[0,4,"",null,null,null,19,"Information",1,null,null,null,null,null,"","   (0)   -  ","  "]
[0,5,"",null,null,null,20,"grandeur",{"$f":"VLOOKUP(I4,Feuil2!I21:J100,2)*4","v":80},null,null,null,null,null,"","   (0)   -  ","  "]
[0,6,"",null,null,null,21,"1 no 2 sou  3 cla",2,{"$f":"IF(I21=2,1,0)","v":1},null,null,null,null,"","   (0)   -  ","  "]
[0,7,"",null,null,null,22,"nb indices",0,{"$f":"I22/4","v":0},null,null,null,null,"","   (0)   -  ","  "]
[0,8,"",null,null,null,23,null,1,null,null,null,null,null,"","   (0)   -  ","  "]
[0,9,"",null,null,null,24,"Position :",{"$f":"VLOOKUP(I4,Position,10)","v":68.5},18,{"$f":"IF(I24=J24,1,0)","v":0},null,null,null,"","   (0)   -  ","  "]
[0,10,"",null,null,null,25,null,null,null,null,null,null,null,"","   (0)   -  ","  "]
[0,11,"",null,null,null,26,"Liste ;",false,null,null,null,null,null,"","   (0)   -  ","  "]
[0,12,"",null,null,null,27,null,null,null,null,null,null,null,"","   (0)   -  ","  "]
[0,13,"",null,null,null,28,null,null,null,null,null,null,null,"","   (0)   -  ","  "]
[0,14,"",null,null,null,29,null,null,null,null,null,null,null,"","   (0)   -  ","  "]
[0,15,"",null,null,null,30,"Tirage abcd",1,71,null,null,null,null,"","   (0)   -  ","  "]
[0,16,"",null,null,null,31,null,2,42,null,"selection",{"$f":"INDEX(I36:J40,M33,2)","v":{"$error":"#VALUE!"}},null,"","   (0)   -  ","  "]
[0,17,"",null,null,null,32,null,3,26,null,"rep menu",0,null,"","   (0)   -  ","  "]
[0,18,"",null,null,null,33,null,4,36,null,"rep ABCD",{"$f":"M32-1","v":-1},null,"","   (0)   -  ","  "]
[0,19,"",null,null,null,34,null,5,73,null,"v ABCD",{"$f":"MATCH(5,M36:M40,0)","v":3},null,"","   (0)   -  ","  "]
[0,20,"",null,null,null,35,null,"rang",null,{"$f":"IF(M35=1,\"oui\",\"non\")","v":"non"},null,{"$f":"IF(M33=M34,1,0)","v":0},null,"","   (0)   -  ","  "]
[0,21,"",null,null,null,36,"A",{"$f":"RANK(J30,$J$30:$J$34)","v":2},{"$f":"VLOOKUP(I36,$I$30:$J$34,2)","v":42},1,{"$f":"IF($I$4>80,\"\",\"A   \"&VLOOKUP(J36,Feuil2!$A$20:$B$100,2))","v":""},{"$f":"I36","v":2},null,"","   (0)   -  ","  "]
[0,22,"",null,null,null,37,"B",{"$f":"RANK(J31,$J$30:$J$34)","v":3},{"$f":"VLOOKUP(I37,$I$30:$J$34,2)","v":26},2,{"$f":"IF($I$4>80,\"\",\"B   \"&VLOOKUP(J37,Feuil2!$A$20:$B$100,2))","v":""},{"$f":"I37","v":3},null,"","   (0)   -  ","  "]
[0,23,"",null,null,null,38,"C",5,73,3,{"$f":"IF($I$4>80,\"\",\"C   \"&VLOOKUP(J38,Feuil2!$A$20:$B$100,2))","v":""},5,null,"","   (0)   -  ","  "]
[0,24,"",null,null,null,39,"D",4,36,4,{"$f":"IF($I$4>80,\"\",\"D   \"&VLOOKUP(J39,Feuil2!$A$20:$B$100,2))","v":""},4,null,"","   (0)   -  ","  "]
[0,25,"",null,null,null,40,"E",1,71,5,{"$f":"IF($I$4>80,\"\",\"E   \"&VLOOKUP(J40,Feuil2!$A$20:$B$100,2))","v":""},1,null,"","   (0)   -  ","  "]
[0,26,"",null,null,null,41,null,null,null,"lettre juste",{"$f":"VLOOKUP(M34+35,G36:H40,2)","v":"C"},null,null,"","   (0)   -  ","  "]
[0,27,"",null,null,null,null,null,null,null,null,null,null,null,"","   (0)   -  ","  "]
[0,28,"",null,null,null,null,null,null,null,null,null,null,null,"","   (0)   -  ","  "]
[0,29,"",null,null,null,null,null,null,null,null,null,null,null,"","   (0)   -  ","  "]
[0,30,"",null,null,null,null,null,null,null,null,null,null,null,"","   (0)   -  ","  "]
[0,31,"",null,null,null,null,null,null,null,null,null,null,null,"","   (0)   -  ","  "]
[0,32,"",null,null,null,null,null,null,null,null,null,null,null,"","   (0)   -  ","  "]
[0,33,{"$f":"IF(A48=0,\"\",Q48&VLOOKUP(A48,Data,2))","v":""},null,null,null,null,null,null,null,null,null,null,null,"","   (0)   -  ","  "]
[0,34,"",null,null,null,null,null,null,null,null,null,null,null,"","   (0)   -  ","  "]
[0,35,"",null,null,null,null,null,null,null,null,null,null,null,"","   (0)   -  ","  "]
[0,36,"",null,null,null,null,null,null,null,null,null,null,null,"","   (0)   -  ","  "]
[0,37,"",null,null,null,null,null,null,null,null,null,null,null,"","   (0)   -  ","  "]
[0,38,"",null,null,null,null,null,null,null,null,null,null,null,"","   (0)   -  ","  "]
[0,39,"",null,null,null,null,null,null,null,null,null,null,null,"","   (0)   -  ","  "]
[0,40,"",null,null,null,null,null,null,null,null,null,null,null,"","   (0)   -  ","  "]
[0,41,"",null,null,null,null,null,null,null,null,null,null,null,"","   (0)   -  ","  "]
[0,42,"",null,null,null,null,null,null,null,null,null,null,null,"","   (0)   -  ","  "]
[0,43,"",null,null,null,null,null,null,null,null,null,null,null,"","   (0)   -  ","  "]
[0,44,"",null,null,null,null,null,null,null,null,null,null,null,"","   (0)   -  ","  "]
[0,45,"",null,null,null,null,null,null,null,null,null,null,null,"","   (0)   -  ","  "]
{"$rows_left_out":40}
{"sheet":"Aide visuelle","index":1,"n_rows":50,"n_cols":7,"rows_kept":50,"cut":false,"hidden":false,"merged":[]}
[]
[]
[]
[]
[]
[]
[]
[]
[]
[]
[]
[]
[]
[]
[]
[]
[]
[]
[]
["Ne pas confondre…",null,null,null,"https://www.toutoupourlechien.com/race-de-chien.html"]
[]
[]
[]
[]
[]
[]
[]
[]
[]
[null,null,null,null,"Le Bullmastiff est plus plus petit mais plus agressif que le Mastiff."]
[]
[]
[]
[]
[]
[]
[]
[]
[]
[null,null,null,null,"Le Groenendael est noir avec des longs poils. Le Tervueren idem mais couleur fauve avec "]
[null,null,null,null,null,null,"des joues poilues. Le Malinois a le poil dur et un masque noire."]
[]
[]
[]
[]
[]
[]
[]
[]
[null,null,null,"Le Coton a un poil cotonneux alors que celui du Bichon est soyeux."]

{"sheet":"Feuil2","index":2,"n_rows":103,"n_cols":99,"rows_kept":103,"cut":false,"hidden":true,"merged":[]}
["v. 09.05.2020",1,2,3,4,5,6,7,8,9,10,11,12,13,14,15,16,17,18,19,20,21,22,23,24,25,26,27,28,29,30,31,32,33,34,35,36,37,38,39,40,41,42,43,44,45,46,47,48,49,50,51,52,53,54,55,56,57,58,59,60,61,62,63,64,65,66,67,68,69,70,71,72,73,74,75,76,77,78,79,80,81,82,83,84,85,86,87,88,89,90,91,92,93,94,95,null,null,90]
[null,null,null,null,null,null,null,null,null,null,null,null,null,null,null,null,null,null,null,null,null,null,null,null,null,null,null,null,null,null,null,null,null,null,null,null,null,null,null,null,null,null,null,null,null,null,null,null,null,null,null,null,null,null,null,null,null,null,null,null,null,null,null,null,null,null,null,null,null,null,null,null,null,null,null,null,null,null,null,null,null,null,"Bienvenue dans le QUIZ canin.                                                                                    Cliquez sur le chien pour  voir  un nouvel animal !                       (ou Ctrl + q)","Tous les chiens ont été vus…                                  Bravo !"]
[]
["Nom","Airedale Terrier","Akita Inu","Amstaff","Barbet","Barbu Tchèque","Barzoï","Basset Hound","Beagle","Bearded Collie","Beauceron","Berger Allemand","Berger Australien","Berger Blanc Suisse","Bergamasque","Bichon Maltais","Bobtail","Border Collie","Bouledogue","Bouvier Bernois","Boxer","Braque allemand","Braque de Weimar","Briard","Bull Terrier","Bullmastiff","Cairn Terrier","Caniche","Carlin","Cavalier King Charles","Chien du pharaon","Chihuahua","Chow Chow","Cocker Anglais","Colley","Coton de Tuléar","Dalmatien","Dobermann","Dogue Allemand","Epagneul Breton","Eurasier","Flat-Coated Retriever","Fox Terrrier","Golden Retriever","Griffon Belge","Groendael","Hovawart","Husky Sibérien","Irish Terrier","Jack Russell","Labrador","Lagotto","Leonberg","Malamute","Malinois","Mastiff","Mâtin de Naples","Montagne des Pyrénées","Norwich-Terrier","Pékinois","Pointer","Rhodesian","Rottweiler","Saint-Bernard","Saint Hubert","Schnauzer","Shetland","Setter Anglais","Setter Gordon","Setter Irlandais","Shar-Pei","Spitz Japonais","Springer Spaniel","Teckel","Terre Neuve","Terrier Ecossais","Tervueren","Welsh Corgi Cardigan","Westie","Whippet","Yorkshire"]
["Groupe",{"$f":"VLOOKUP(B6,Races,2)","v":"Terrier"},"Spitz et primitif","Terrier","Chiens de rapport, leveurs et chiens d'eau","Chiens d'arrêt","Lévriers","Chiens courants","Chiens courants","Chiens de berger et bouviers","Chiens de berger et bouviers","Chiens de berger et bouviers","Chiens de berger et bouviers",{"$f":"VLOOKUP(N6,Races,2)","v":"Chiens de berger et bouviers"},"Chiens de berger et bouviers","Chiens de compagnie","Chiens de berger et bouviers","Chiens de berger et bouviers","Chiens de compagnie","Pinscher et Schnauzer, molossoïdes et Bouviers suisses","Pinscher et Schnauzer, molossoïdes et Bouviers suisses","Chiens d'arrêt","Chiens d'arrêt","Chiens de berger et bouviers","Terrier","Pinscher et Schnauzer, molossoïdes et Bouviers suisses","Terrier","Chiens de compagnie","Chiens de compagnie","Chiens de compagnie",{"$f":"VLOOKUP(AE6,Races,2)","v":"Spitz et primitif"},"Chiens de compagnie","Spitz et primitif","Chiens de rapport, leveurs et chiens d'eau","Chiens de berger et bouviers","Chiens de compagnie","Chiens courants","Pinscher et Schnauzer, molossoïdes et Bouviers suisses","Pinscher et Schnauzer, molossoïdes et Bouviers suisses","Chiens d'arrêt","Spitz et primitif","Chiens de rapport, leveurs et chiens d'eau","Terrier","Chiens de rapport, leveurs et chiens d'eau",{"$f":"VLOOKUP(AS6,Races,2)","v":"Chiens de compagnie"},{"$f":"VLOOKUP(AT6,Races,2)","v":"Chiens de berger et bouviers"},"Pinscher et Schnauzer, molossoïdes et Bouviers suisses","Spitz et primitif","Terrier","Terrier","Chiens de rapport, leveurs et chiens d'eau","Chiens de rapport, leveurs et chiens d'eau","Pinscher et Schnauzer, molossoïdes et Bouviers suisses","Spitz et primitif",{"$f":"VLOOKUP(BC6,Races,2)","v":"Chiens de berger et bouviers"},"Pinscher et Schnauzer, molossoïdes et Bouviers suisses","Pinscher et Schnauzer, molossoïdes et Bouviers suisses",{"$f":"VLOOKUP(BF6,Races,2)","v":"Pinscher et Schnauzer, molossoïdes et Bouviers suisses"},"Terrier","Chiens de compagnie",{"$f":"VLOOKUP(BI6,Races,2)","v":"Chiens d'arrêt"},"Chiens courants","Pinscher et Schnauzer, molossoïdes et Bouviers suisses","Pinscher et Schnauzer, molossoïdes et Bouviers suisses",{"$f":"VLOOKUP(BM6,Races,2)","v":"Chiens courants"},"Pinscher et Schnauzer, molossoïdes et Bouviers suisses",{"$f":"VLOOKUP(BO6,Races,2)","v":"Chiens de berger et bouviers"},"Chiens d'arrêt","Chiens d'arrêt","Chiens d'arrêt","Pinscher et Schnauzer, molossoïdes et Bouviers suisses","Spitz et primitif","Chiens de rapport, leveurs et chiens d'eau",{"$f":"VLOOKUP(BV6,Races,2)","v":"Teckels"},{"$f":"VLOOKUP(BW6,Races,2)","v":"Pinscher et Schnauzer, molossoïdes et Bouviers suisses"},{"$f":"VLOOKUP(BX6,Races,2)","v":"Terrier"},{"$f":"VLOOKUP(BY6,Races,2)","v":"Chiens de berger et bouviers"},{"$f":"VLOOKUP(BZ6,Races,2)","v":"Chiens de berger et bouviers"},{"$f":"VLOOKUP(CA6,Races,2)","v":"Terrier"},{"$f":"VLOOKUP(CB6,Races,2)","v":"Lévriers"},{"$f":"VLOOKUP(CC6,Races,2)","v":"Terrier"}]
["no",3,5,3,8,7,10,6,6,1,1,1,1,1,1,9,1,1,9,2,2,7,7,1,3,2,3,9,9,9,5,9,5,8,1,9,6,2,2,7,5,8,3,8,9,1,2,5,3,3,8,8,2,5,1,2,2,2,3,9,7,6,2,2,6,2,1,7,7,7,2,5,8,4,2,3,1,1,3,10,3]
["Max",56,58,43,53,58,68,33,33,51,61,55,46,55,54,20,55,48,29,60,53,57,59,56,35,60,26,28,30,32,53,16,46,38,51,23,54,63,70,46,48,56,33,51,18,56,55,50,40,25,54,41,65,56,56,66,60,65,23,14,61,61,56,65,58,45,32,61,56,55,44,28,41,11,66,25,56,25,26,44,15]
["Min",61,61,61,61,66,85,38,41,56,70,65,58,66,63,25,66,55,35,70,63,68,70,68,45,68,31,60,38,36,63,21,56,41,61,28,61,72,85,51,60,62,39,61,28,66,70,60,50,30,57,48,80,66,66,82,75,80,26,25,69,69,68,90,72,50,38,68,66,67,51,38,58,25,71,28,66,33,28,51,25]
["Moyenne",{"$f":"AVERAGE(B7:B8)","v":58.5},{"$f":"AVERAGE(C7:C8)","v":59.5},52,57,62,76.5,35.5,37,53.5,65.5,60,52,{"$f":"AVERAGE(N7:N8)","v":60.5},58.5,22.5,60.5,51.5,32,65,58,62.5,64.5,62,40,64,28.5,44,34,34,58,18.5,51,39.5,56,25.5,57.5,67.5,77.5,48.5,{"$f":"AVERAGE(AO7:AO8)","v":54},59,36,56,{"$f":"AVERAGE(AS7:AS8)","v":23},{"$f":"AVERAGE(AT7:AT8)","v":61},62.5,55,45,{"$f":"AVERAGE(AX7:AX8)","v":27.5},{"$f":"AVERAGE(AY7:AY8)","v":55.5},44.5,72.5,61,{"$f":"AVERAGE(BC7:BC8)","v":61},74,67.5,{"$f":"AVERAGE(BF7:BF8)","v":72.5},{"$f":"AVERAGE(BG7:BG8)","v":24.5},19.5,65,{"$f":"AVERAGE(BJ7:BJ8)","v":65},62,77.5,{"$f":"AVERAGE(BM7:BM8)","v":65},47.5,{"$f":"AVERAGE(BO7:BO8)","v":35},64.5,61,61,47.5,33,49.5,18,68.5,26.5,{"$f":"AVERAGE(BY7:BY8)","v":61},29,27,47.5,20]
["FCI",7,255,286,105,245,193,163,161,271,44,166,342,347,194,65,16,297,101,45,144,98,99,113,11,157,4,172,253,136,248,218,205,167,156,283,153,143,235,95,291,121,169,111,81,15,190,270,139,345,122,298,145,243,15,264,197,137,72,207,1,146,147,61,84,182,88,2,6,330,309,262,125,148,50,73,15,38,85,162,86]
["autre nom","Bingley - Warfedate"," - ","American Stattordshire -Pitbull"," - ","Griffon tchèque - Cesky Fousek","Lévrier Russe - Borzoi","Basset"," - ","Collie barbu - Beardie","Berger de Beauce","Chien policier","Aussie ","Berger Blanc Canadien","Berger de Bergame","Maltais","Berger Anglais Ancestral"," - ","Bouledogue Français","Bouvier de Berne","Bullenbeisser","Braque allemand à poil sur","Weimaraner","Berger de Brie"," - ","Bull Mastiff"," - ","Barbone","Pug - Mops","Epagneul Cavalier King Charles","Lévrier du Pharaon","Chiwawa","Choo - Chow pando","Epagneul cocker anglais","Berger d'Ecosse","Coton","Dalmatian","Dobermasnn Pinscher","Danois - Grand Danois"," - ","Loup-Chow","Retriever à poil plat","Fox à poil dur","Golden"," - ","Berger Belge Groendael"," - ","Husky","Terrier irlandais","Jack Russell terrier","Labrador - Retriever","Chien d'eau ramognol"," - ","Malamude de l'Alasska","Berger Belge Malinois","Dogue Anglais","Nealotilan Mastiff","Patou - Grand Pyrénéen",null,"Epagneul de Pékin","Pointer Anglais","Ridgeback - African Lion Hound","Chien de Boucher"," - ","Bloodhound"," - ","Berger des Shetland"," - ","Gordon","Setter Rouge","Chien de combat chinois","Supittsu","Springer Anglais"," - ","Newfie","Scottish Terrrier","Berger Belge Tervueren"," - ","West Highland ","Lévrier nain","York"]
[null,null,null,null,null,null,null,null,null,null,null,null,null,null,null,null,null,null,null,null,null,null,null,null,null,null,null,null,null,null,null,null,null,null,null,null,null,null,null,null,null,null,null,null,null,null,null,null,null,null,null,null,null,243]
[]
[]
[]
[]
[]
["https://www.vogelwarte.ch/fr/oiseaux/les-oiseaux-de-suisse/"]
[]
[null,null,null,null,null,null,null,null,"no","Taille","Indice","Indice et groupe","Autres noms","Classification des races FCI"]
[1,{"$f":"TRANSPOSE(B4:CC6)","v":"Airedale Terrier"},"Terrier",3,{"$f":"A21&\"    \"&B21","v":"1    Airedale Terrier"},{"$f":"\"A  \"","v":"A  "},{"$f":"F21&\"     \"&B21","v":"A       Airedale Terrier"},{"$f":"\"      \"&A21","v":"      1"},1,{"$f":"TRANSPOSE(B9:CC9)","v":58.5},"A -> B",{"$f":"K21&\"   (gr  \"&D21&\")\"","v":"A -> B   (gr  3)"},{"$f":"TRANSPOSE(B11:CC11)","v":"Bingley - Warfedate"},1,"Chiens de berger et bouviers"]
[2,"Akita Inu","Spitz et primitif",5,{"$f":"A22&\"    \"&B22","v":"2    Akita Inu"},{"$f":"\"    \"","v":"    "},{"$f":"F22&\"     \"&B22","v":"         Akita Inu"},{"$f":"\"      \"&A22","v":"      2"},2,59.5,"A -> B",{"$f":"K22&\"   (gr  \"&D22&\")\"","v":"A -> B   (gr  5)"}," - ",2,"Pinscher et Schnauzer, molossoïdes et Bouviers suisses"]
[3,"Amstaff","Terrier",3,{"$f":"A23&\"   \"&B23","v":"3   Amstaff"},{"$f":"\"    \"","v":"    "},{"$f":"F23&\"     \"&B23","v":"         Amstaff"},"      3",3,52,"A -> B","A -> B   (gr  3)","American Stattordshire -Pitbull",3,"Terrier"]
[4,"Barbet","Chiens de rapport, leveurs et chiens d'eau",8,{"$f":"A24&\"    \"&B24","v":"4    Barbet"},{"$f":"\"B  \"","v":"B  "},{"$f":"F24&\"     \"&B24","v":"B       Barbet"},"      4",4,57,"A -> B","A -> B   (gr  8)"," - ",4,"Teckels"]
[5,"Barbu Tchèque","Chiens d'arrêt",7,"5    Barbu Tchèque",{"$f":"\"    \"","v":"    "},"         Barbu Tchèque","      5",5,62,"A -> B","A -> B   (gr  7)","Griffon tchèque - Cesky Fousek",5,"Spitz et primitif"]
[6,"Barzoï","Lévriers",10,"6    Barzoï","    ","         Barzoï","      6",6,76.5,"A -> B","A -> B   (gr  10)","Lévrier Russe - Borzoi",6,"Chiens courants"]
[7,"Basset Hound","Chiens courants",6,"7    Basset Hound","    ","         Basset Hound","      7",7,35.5,"A -> B","A -> B   (gr  6)","Basset",7,"Chiens d'arrêt"]
[8,"Beagle","Chiens courants",6,"8    Beagle","    ","         Beagle","      8",8,37,"A -> B","A -> B   (gr  6)"," - ",8,"Chiens de rapport, leveurs et chiens d'eau"]
[9,"Bearded Collie","Chiens de berger et bouviers",1,{"$f":"A29&\"    \"&B29","v":"9    Bearded Collie"},"    ","         Bearded Collie","      9",9,53.5,"A -> B","A -> B   (gr  1)","Collie barbu - Beardie",9,"Chiens de compagnie"]
[10,"Beauceron","Chiens de berger et bouviers",1,{"$f":"A30&\"  \"&B30","v":"10  Beauceron"},"    ","         Beauceron","      10",10,65.5,"A -> B","A -> B   (gr  1)","Berger de Beauce",10,"Lévriers"]
[11,"Berger Allemand","Chiens de berger et bouviers",1,"11  Berger Allemand","    ","         Berger Allemand","      11",11,60,"A -> B","A -> B   (gr  1)","Chien policier"]
[12,"Berger Australien","Chiens de berger et bouviers",1,"12  Berger Australien","    ","         Berger Australien","      12",12,52,"A -> B","A -> B   (gr  1)","Aussie "]
[13,"Berger Blanc Suisse","Chiens de berger et bouviers",1,"13  Berger Blanc Suisse","    ","         Berger Blanc Suisse","      13",13,60.5,"A -> B","A -> B   (gr  1)","Berger Blanc Canadien"]
[14,"Bergamasque","Chiens de berger et bouviers",1,"14  Bergamasque","    ","         Bergamasque","      14",14,58.5,"A -> B","A -> B   (gr  1)","Berger de Bergame"]
[15,"Bichon Maltais","Chiens de compagnie",9,"15  Bichon Maltais","    ","         Bichon Maltais","      15",15,22.5,"A -> B","A -> B   (gr  9)","Maltais"]
[16,"Bobtail","Chiens de berger et bouviers",1,"16  Bobtail","    ","         Bobtail","      16",16,60.5,"A -> B","A -> B   (gr  1)","Berger Anglais Ancestral"]
[17,"Border Collie","Chiens de berger et bouviers",1,"17  Border Collie","    ","         Border Collie","      17",17,51.5,"A -> B","A -> B   (gr  1)"," - "]
[18,"Bouledogue","Chiens de compagnie",9,"18  Bouledogue","    ","         Bouledogue","      18",18,32,"A -> B","A -> B   (gr  9)","Bouledogue Français"]
[19,"Bouvier Bernois","Pinscher et Schnauzer, molossoïdes et Bouviers suisses",2,"19  Bouvier Bernois","    ","         Bouvier Bernois","      19",19,65,"A -> B","A -> B   (gr  2)","Bouvier de Berne"]
[20,"Boxer","Pinscher et Schnauzer, molossoïdes et Bouviers suisses",2,"20  Boxer","    ","         Boxer","      20",20,58,"A -> B","A -> B   (gr  2)","Bullenbeisser"]
[21,"Braque allemand","Chiens d'arrêt",7,"21  Braque allemand","    ","         Braque allemand","      21",21,62.5,"A -> B","A -> B   (gr  7)","Braque allemand à poil sur"]
[22,"Braque de Weimar","Chiens d'arrêt",7,"22  Braque de Weimar","    ","         Braque de Weimar","      22",22,64.5,"A -> B","A -> B   (gr  7)","Weimaraner"]
[23,"Briard","Chiens de berger et bouviers",1,"23  Briard","    ","         Briard","      23",23,62,"A -> B","A -> B   (gr  1)","Berger de Brie"]
[24,"Bull Terrier","Terrier",3,"24  Bull Terrier","    ","         Bull Terrier","      24",24,40,"A -> B","A -> B   (gr  3)"," - "]
[25,"Bullmastiff","Pinscher et Schnauzer, molossoïdes et Bouviers suisses",2,"25  Bullmastiff","    ","         Bullmastiff","      25",25,64,"A -> B","A -> B   (gr  2)","Bull Mastiff"]
[26,"Cairn Terrier","Terrier",3,"26  Cairn Terrier",{"$f":"\"C \"","v":"C "},"C      Cairn Terrier","      26",26,28.5,"C -> E","C -> E   (gr  3)"," - "]
[27,"Caniche","Chiens de compagnie",9,"27  Caniche",{"$f":"\"    \"","v":"    "},"         Caniche","      27",27,44,"C -> E","C -> E   (gr  9)","Barbone"]
[28,"Carlin","Chiens de compagnie",9,"28  Carlin","    ","         Carlin","      28",28,34,"C -> E","C -> E   (gr  9)","Pug - Mops"]
[29,"Cavalier King Charles","Chiens de compagnie",9,"29  Cavalier King Charles","    ","         Cavalier King Charles","      29",29,34,"C -> E","C -> E   (gr  9)","Epagneul Cavalier King Charles"]
[30,"Chien du pharaon","Spitz et primitif",5,"30  Chien du pharaon","    ","         Chien du pharaon","      30",30,58,"C -> E","C -> E   (gr  5)","Lévrier du Pharaon"]
[31,"Chihuahua","Chiens de compagnie",9,"31  Chihuahua","    ","         Chihuahua","      31",31,18.5,"C -> E","C -> E   (gr  9)","Chiwawa"]
[32,"Chow Chow","Spitz et primitif",5,"32  Chow Chow","    ","         Chow Chow","      32",32,51,"C -> E","C -> E   (gr  5)","Choo - Chow pando"]
[33,"Cocker Anglais","Chiens de rapport, leveurs et chiens d'eau",8,"33  Cocker Anglais","    ","         Cocker Anglais","      33",33,39.5,"C -> E","C -> E   (gr  8)","Epagneul cocker anglais"]
[34,"Colley","Chiens de berger et bouviers",1,"34  Colley","    ","         Colley","      34",34,56,"C -> E","C -> E   (gr  1)","Berger d'Ecosse"]
[35,"Coton de Tuléar","Chiens de compagnie",9,"35  Coton de Tuléar","    ","         Coton de Tuléar","      35",35,25.5,"C -> E","C -> E   (gr  9)","Coton"]
[36,"Dalmatien","Chiens courants",6,"36  Dalmatien",{"$f":"\"D \"","v":"D "},"D      Dalmatien","      36",36,57.5,"C -> E","C -> E   (gr  6)","Dalmatian"]
[37,"Dobermann","Pinscher et Schnauzer, molossoïdes et Bouviers suisses",2,"37  Dobermann","    ","         Dobermann","      37",37,67.5,"C -> E","C -> E   (gr  2)","Dobermasnn Pinscher"]
[38,"Dogue Allemand","Pinscher et Schnauzer, molossoïdes et Bouviers suisses",2,"38  Dogue Allemand","    ","         Dogue Allemand","      38",38,77.5,"C -> E","C -> E   (gr  2)","Danois - Grand Danois"]
[39,"Epagneul Breton","Chiens d'arrêt",7,"39  Epagneul Breton",{"$f":"\"E  \"","v":"E  "},"E       Epagneul Breton","      39",39,48.5,"C -> E","C -> E   (gr  7)"," - "]
[40,"Eurasier","Spitz et primitif",5,"40  Eurasier","    ","         Eurasier","      40",40,54,"C -> E","C -> E   (gr  5)","Loup-Chow"]
{"$rows_left_out":43}