{"text_format":"1","workbook":"xlsx","n_sheets":7,"sheets":["QUIZ","Notice","Aide","Théories","Data","Portrait","Texte"],"not_rendered":{"charts":0,"images":106,"macros":1,"external_links":1,"defined_names":6,"comments":0,"pivot_tables":0},"unopened":[],"bounds":{"document_bytes":16777216,"sheet_cells":100000,"rows_first":2000,"rows_last":500,"rows_between":2000,"halvings":0,"cell_chars":16384,"cell_head_chars":4096},"cells_cut":0,"cells_raw":0,"read":"whole","date_system":"1900"}

{"sheet":"QUIZ","index":0,"n_rows":17,"n_cols":16,"rows_kept":17,"cut":false,"hidden":false,"merged":[[16,3,16,5],[0,4,2,4],[0,5,1,5],[2,5,2,8],[3,17,3,18],[4,17,6,18]]}
[" ",null,null,null,null,{"$f":"IF(K1=K2,\"C\",\"\")","v":""},{"$f":"\"zoom \"&O3","v":"zoom 128"},"+",null,"Tirage",42,"nb :",40,"couleur :",{"$f":"VLOOKUP(QUIZ!K1,Data!A1:G40,7)","v":"J"}]
[null,null,null,null,null,null,null,"-",null,"Réponse",{"$f":"IF(L6=TRUE,L2-1,VLOOKUP(L2-1,Data!A101:C141,3))","v":0},1,null,"Indice ->",2,"Image mné"]
[null,null,{"$f":"IF(K1=42,\"\",VLOOKUP($K$1,Data!$A$1:$F$42,4))","v":""},"     Je suis …",null,{"$f":"IF(K1=43,\"parti…!!!\",(IF(K1=K2,VLOOKUP(K1,Data!A2:B41,2),\"   ?\")))","v":"   ?"},null,null,null,"Indices",false,false,false,"zoom",128,false]
[null,{"$f":"IF(K1>40,\"\",IF(M2=\"Voir\",\"C\",IF(K1=K2,\"P\",\":\")))","v":""},null,null,null,null,null,null,null,null,null,null,null,null,{"$f":"VLOOKUP(K1,Data!A1:J44,8)","v":"                                                                                                                                                                           J'ai dit …"}]
[null,null,{"$f":"IF(K3=TRUE,VLOOKUP($K$1,Data!$A$2:$F$42,3),\"\")","v":""},null,null,null,null,null,null,null,null,null,null,null,null,{"$f":"IF(P3=TRUE,K1,50)","v":50}]
[null,null,{"$f":"IF(L3=TRUE,VLOOKUP($K$1,Data!$A$2:$F$42,5),\"\")","v":""},null,null,null,null,null,null,"Liste chronol.",1,{"$f":"IF(K6=1,TRUE,FALSE)","v":true},null,"Rech.",{"$f":"VLOOKUP(L2-1,Data!A101:C141,3)","v":0}]
[null,null,{"$f":"IF(M3=TRUE,VLOOKUP($K$1,Data!$A$2:$F$42,6),\"\")","v":""}]
["   Liste :",null,{"$f":"IF(K6=1,\"Economistes par ordre chronologique   ---> \",\" Economistes par ordre alphabétique   ---> \")","v":"Economistes par ordre chronologique   ---> "}]
[]
[0,"questions",{"$f":"IF(A10<1,\"\",REPT(\"n\",A10))","v":""}]
{"$rows_left_out":8}
{"sheet":"Notice","index":1,"n_rows":0,"n_cols":0,"rows_kept":0,"cut":false,"hidden":false,"merged":[]}

{"sheet":"Aide","index":2,"n_rows":281,"n_cols":2,"rows_kept":281,"cut":false,"hidden":false,"merged":[]}
[]
[]
[]
[]
[]
[]
[]
[]
[]
[]
{"$rows_left_out":272}
{"sheet":"Théories","index":3,"n_rows":246,"n_cols":10,"rows_kept":246,"cut":false,"hidden":false,"merged":[[2,9,3,11]]}
[null,null,"Auteur","Nom de la théorie","Résumé",null,false,false]
["1519 Londres - 1579",null,"Gresham Thomas","Loi de la mauvaise monnaie","Lorsque deux monnaies ont la même valeur légale mais des valeurs réelles différentes, les agents thésaurisent (gardent) la monnaie de valeur supérieure et dépensent la moins bonne, entraînant la disparition de la première. "]
["1619 Reims - 1683 Paris",null,"Colbert Jean-Baptiste","Le mercantilisme","Doctrine économique dominante en Europe du XVIe au XVIIe siècle, liant la puissance d'un État à l'accumulation de métaux précieux (or, argent). Elle prône un fort protectionnisme, favorisant les exportations et limitant les importations pour dégager un excédent commercial, souvent avec une intervention étatique rigoureuse. Le développement d’un pays ne peut passer qu’à travers l’enrichissement par le biais du commerce extérieur.",null,null,null,null,"Trouver le nom de la théorie et l'auteur ou inversément !"]
["1694 Méré - Versailles 1774 ",null,"Quesney François","Le Tableau économique","Publié pour la première fois en 1758 ce tableau est considéré comme le premier modèle de circuit macroéconomique de l'histoire. L'auteur, inspiré par ses connaissances de médecin sur la circulation sanguine, y décrit la circulation des richesses entre les différentes composantes de la société."]
["1723 Écosse - Édimbourg 1790",null,"Smith Adam","La main invisible","Métaphore suggérant que des individus poursuivant leur propre intérêt personnel contribuent, sans le vouloir, à l'intérêt général et à l'efficacité économique. Ce mécanisme suppose que le marché autorégulé et concurrentiel alloue les ressources de manière optimale sans intervention étatique forte. "]
["1760 Paris - Paris 1854",null,"de Saint-Simon Henri","Parabole des abeilles et des frelons","Ce texte dénonce une organisation sociale archaïque où ceux qui travaillent et créent la richesse sont subordonnés à ceux qui ne produisent rien. Question provocatrice : quelles pertes seraient les plus dommageables pour la France ? La perte des « 3000 producteurs » savants, artistes, artisans, banquiers et agriculteurs  (les « abeilles ») ou la perte des « 30'000 oisifs » famille royale, grands officiers de la ouronne, ministres, conseillers d'État et membres du haut clergé (les « frelons »)"]
["1766 Surrey - Claverton, 1834",null,"Malthus Thomas Robert","Loi de la population","Cette loi soutient que la population croît plus vite (progression géométrique : 1, 2, 4, 8...) que les ressources alimentaires (progression arithmétique : 1, 2, 3, 4...). Ce déséquilibre inévitable mène à des catastrophes (famines, guerres, maladies) régulant la population."]
["1767 Lyon  - Paris 1832",null,"Say Jean-Baptiste","Loi des débouchés","Cette loi libérale se résume ainsi : toute offre débouche par créer sa propre demande. En pratique une entreprise qui met un bien sur le marché donne l’équivalent de sa valeur à ses salariés sous forme de salaires et à ses propriétaires sous forme de dividendes. On vend un produit, non pas pour récupérer de la monnaie, mais pour pouvoir en acheter un autre. « Les produits s’échangent contre des produits », la monnaie « n’est qu’un voile »."]
["1772 Londres - Gloucestershire, 1823",null,"Ricardo David","Les avantages comparatifs","Théorie qui explique que, dans un contexte de libre-échange, chaque pays a intérêt à se spécialiser dans la production pour laquelle il dispose de l'écart de productivité (ou du coût) le plus fort en sa faveur, ou le plus faible en sa défaveur, comparativement à ses partenaires."]
["1773 Genève  - id. 1842",null,"de Sismondi Jean-Léonard","Loi  du machinisme","Thèse qui soutient que l'introduction des machines dans le processus de production et la recherche du profit mènent à des crises de surproduction. Si elle augmente la productivité, elle rend une partie des ouvriers inutiles, entraînant licenciements et baisse des salaires. La loi des débouchés est ainsi contestée, arguant que la baisse des salaires réduit la demande globale, rendant la consommation insuffisante par rapport à la capacité de production. "]
{"$rows_left_out":237}
{"sheet":"Data","index":4,"n_rows":142,"n_cols":12,"rows_kept":142,"cut":false,"hidden":true,"merged":[]}
[0,"Nom :","Origine","Titre","Ecole","Ouvrages",null,"Citations",null,"   "]
[1,"Gresham Thomas","1519 Londres - 1579","Commerçant et banquier anglais - Spécialise monétaire","Mercantilisme","La Banque des Médicis - ","V","                                                          Lorsque ciruculent dans un pays deux monnaies dont l'une est considérée par le public comme bonne et l'autre mauvaise, la mauvaise chasse la bonne."]
[2,"Colbert Jean-Baptiste","1619 Reims - 1683 Paris","Contrôleur général des finances","Mercantilisme","Code Noir (1685)","R","                                                                    L'art de l'imposition consiste à plumer l'oie pour obtenir le plus possible de plumes avec  le moins possible de cris.",null,null,null,"https://www.youtube.com/watch?v=rnWRddz3Emg"]
[3,"Quesney François","1694 Méré - Versailles 1774 ","Chirurgien puis économiste français","Physiocratie","Tables Oeconomique (1758) - Physiocatie : droit natuel (1769)","V","                                           Pauvres paysans, pauvre royaume   -   Nul travail ne peut être effectué sans des avances préalables. L'enfant a reçu la nourriture de ses parents avant de la chercher.",null,null,null,"https://www.youtube.com/watch?v=tuJX_p80IwI"]
[4,"Smith Adam","1723 Écosse - Édimbourg 1790","Économiste britannique","Fondateur école classique","La Richesse des Nations (1776)","V","                                                                           Aucune société ne peut prospérer et être heureuse, dans laquelle la plus grande partie des membres est pauvre et misérable."]
[5,"de Saint-Simon Henri","1760 Paris - Paris 1854","Économiste et philosophe français","Utopistes","Le Politique (1819) - Catéchisme des industriels (1824)","R","                                                                                                        L'art de s'avancer et de parvenir, c'est l'art d'offrir sa main à qui l'on voudrait donner son pied."]
[6,"Malthus Thomas Robert","1766 Surrey - Claverton, 1834","Économiste britannique","Classique","Essai sur le principe de population (1798)","V","                                                                                                                               La difficulté n'est pas de faire des enfants, mais de les nourrir.",null,null,null,"https://www.youtube.com/watch?v=R3nKcujADTY"]
[7,"Say Jean-Baptiste","1767 Lyon  - Paris 1832","Économiste français","Classique","Cours complet d’économie politique pratique (1804)","V","                                                                                                                            On n’est jamais mieux gouverné que lorsqu’il n’y a pas de gouvernement. ",null,null,null,"https://www.youtube.com/watch?v=-Iq0pmS-SJA"]
[8,"Ricardo David","1772 Londres - Gloucestershire, 1823","Économiste britannique","Classique","Les principes de l’économie politique et de l’impôt (1817)","V","                                                   Ainsi que tout autre contrat, les salaires doivent être livrés à la concurrence franche et libre du marché, et n'être jamais entravés par l'intervention du Gouverneur.",null,null,null,"https://www.youtube.com/watch?v=XKGjVImBWog"]
[9,"de Sismondi Jean-Léonard","1773 Genève  - id. 1842","Historien et économiste suisse","Classique","Nouveaux Principes d'économie politique (1819)","R","                                                                      Ce n'est point le perfectionnement des machines qui est la vraie calamité ; c'est le partage injuste que nous faisons de leur produit."]
{"$rows_left_out":133}
{"sheet":"Portrait","index":5,"n_rows":45,"n_cols":50,"rows_kept":45,"cut":false,"hidden":true,"merged":[]}
[null,1,2,3,4,5,6,7,8,9,10,11,12,13,14,15,16,17,18,19,20,21,22,23,24,25,26,27,28,29,30,31,32,33,34,35,36,37,38,39,40,43,44,45,46,45,41,42,43,44]
[]
[]
[]
[null,null,null,null,null,null,null,null,null,null,null,null,null,null,null,null,null,null,null,null,null,null,null,null,null,null,null,null,null,null,null,null,null,null,null,null,null,null,null,null,null,"?","?"]
[null,{"$f":"Texte!B4","v":"Gresham Thomas"},{"$f":"Texte!C4","v":"Colbert Jean-Baptiste"},{"$f":"Texte!D4","v":"Quesney François"},{"$f":"Texte!E4","v":"Smith Adam"},{"$f":"Texte!F4","v":"de Saint-Simon Henri"},{"$f":"Texte!G4","v":"Malthus Thomas Robert"},{"$f":"Texte!H4","v":"Say Jean-Baptiste"},{"$f":"Texte!I4","v":"Ricardo David"},{"$f":"Texte!J4","v":"de Sismondi Jean-Léonard"},{"$f":"Texte!K4","v":"Bastiat Frédéric"},{"$f":"Texte!L4","v":"Mill John Stuart"},{"$f":"Texte!M4","v":"Proudhon Pierre-Joseph"},{"$f":"Texte!N4","v":"Marx Karl"},{"$f":"Texte!O4","v":"Walras Léon"},{"$f":"Texte!P4","v":"Marshall Alfred"},{"$f":"Texte!Q4","v":"Pareto Vilfredo"},{"$f":"Texte!R4","v":"Bernstein Eduard"},{"$f":"Texte!S4","v":"Rist Charles"},{"$f":"Texte!T4","v":"Keynes John Maynard"},{"$f":"Texte!U4","v":"Schumpeter Joseph"},{"$f":"Texte!V4","v":"Monnet Jean"},{"$f":"Texte!W4","v":"Kondratiev Nikolaï"},{"$f":"Texte!X4","v":"von Hayek Friedrich"},{"$f":"Texte!Y4","v":"Hicks John"},{"$f":"Texte!Z4","v":"Leontief Wassily"},{"$f":"Texte!AA4","v":"Fourastié Jean "},{"$f":"Texte!AB4","v":"Kaldor Nicholas"},{"$f":"Texte!AC4","v":"Galbraith John Kenneth"},{"$f":"Texte!AD4","v":"Friedman Milton"},{"$f":"Texte!AE4","v":"Samuelson Paul Anthony"},{"$f":"Texte!AF4","v":"Tobin James"},{"$f":"Texte!AG4","v":"Klein Lawrence Robert "},{"$f":"Texte!AH4","v":"Barre Raymond"},{"$f":"Texte!AI4","v":"Nash John Forbes"},{"$f":"Texte!AJ4","v":"Sen Amartya"},{"$f":"Texte!AK4","v":"Lucas Robert Emerson"},{"$f":"Texte!AL4","v":"Yunus Muhammad"},{"$f":"Texte!AM4","v":"Laffer Arthur"},{"$f":"Texte!AN4","v":"Stiglitz Joseph"},{"$f":"Texte!AO4","v":"Piketty Thomas"}]
[]
[null,null,null,null,null,null,null,null,null,null,null,null,null,null,"Valeur utilité"]
[]
[null,"Avec le cholestérol la mauvaise graisse chasse la bonne. Avec la monnaie c'est la même chose !","Plumer l'oie (ou le canard colvert) avec le moins de cris possible.","Pauvres paysans, pauvre royaume. Qu'est-ce ce négatif diagnostique docteur ?","La main invisible, ce mythe à damner. La somme des intérêts individuels amène à l'équilibre général.","Du travail obligatoire pour tous, si mon rêve s'exhausse.","Il est plus facile de les faire que de les nourrir mal tous !","L'offre est le moteur de la demande, la monnaie qu'un intermédiaire, tout le monde le sait !","Le marché du travail doit être ouvert à la concurrence et les pays se spécialiser. Ris car d'autres pensent le contraire !","Le problème ce ne sont pas les nouvelles machines, mais le partage des profits réalisés.","Avec l'État, tout le monde s'efforce de vivre aux dépens de tout le monde, comme en Corse !","Le raisonnement inductif dans la pensée économique des militants associationnistes"," La propriété c'est le vol peu ou prou.","Mettre fin à l'exploitation du travail par le capital. Ceci est ma marque spécifique.","C'est l'utilité qui fait la valeur d'un bien, pas le travail. Le prix assure l'équilibre général O/D.","La valeur par les facteurs de production et l'utilité marginale, voilà comme ça marche à l'École de Cambridge.","Je vais optimiser mes ressources et l'État par retour va augmenter mes impôts.","Il faut adapter le marxisme en berne à la réalité économique.","L'or est la moins mauvaise monnaie, sans risque et Bretten Woods ne veut pas le savoir.","Investissements publics pour le plein-emploi. Personne ne doit rester sur le quai, n'est-ce pas.","L'innovation est le moteur de la croissance, mais la surproduction amène la crise.","Père de l'Europe avec Schuman, Spaak et Gasperi je rêve d'une monnaie unique.","Avec le capitalisme, les phases de croissance (qu'on dramatise en l'estimant à 50 ans) sont suivies de dépressions.","Libre marché et moins d'États pour sauver nos libertés…aïe, aïe, aïe !","Le modèle X \"IS/LM\" détermine la stabilité de l'économie.","Le rôle des personnes est de plus en plus petit comme facteur de production. Les hontes !","Les 30 glorieuses c'est la période après les fours à style macabre.","Le carré magique, il n'y a qu'à le dorloter.","Les entreprises imposent leurs produits aux consommateurs, c'est la filière inversée et galbée.","L'École de Chicago et l'ultralibéralisme par un homme frit.","Les biens faits du commerce international ne sont pas garantis, même avec le SAMU !","Une taxe c'est trop bien pour réduire la spéculation.","Les idées de Keynes mises à jour avec des petits modèles économétriques.","Le frein à la dette publique est mon idée fixe. La barre à droite toute.","Le dilemme du prisonnier et les stratégies coopératives dans les prisons de Nashville.","L'indice de développement humain au service de l'économie du bien-être pour rester zen.","Les agents économiques sont intelligents et rationnels. La politique budgétaire n'est qu'une lucarne qui ne sert à rien.","Du microcrédit pour les pauvres dans son jus.","Trop d'impôt tue l'impôt… la belle affaire !","Selon la notion de salaire d'efficience, la productivité dépend d'un salaire stimulant.","La principale caractéristique du capitalisme c'est de créer des inégalités inquiétantes. Signé Picsous."]
{"$rows_left_out":36}
{"sheet":"Texte","index":6,"n_rows":15,"n_cols":100,"rows_kept":15,"cut":false,"hidden":true,"merged":[]}
[null,1,2,3,4,5,6,7,8,9,10,11,12,13,14,15,16,17,18,19,20,21,22,23,24,25,26,27,28,29,30,31,32,33,34,35,36,37,38,39,40,41,42,43,44,45,46,47,48,49,50,51,52,53,55,56,57,58,59,60,61,62,63,64,65,55,56,57,58,59,60,61,62,63,64,65,66,67,68,69,70,71,72,73,74,75,76,77,78,79,80,81,82,83,84,85,86,87,88,89]
[null,null,null,null,null,null,null,null,null,null,null,null,null,null,null,null,null,null,null,null,null,null,null,null,null,null,null,null,null,null,null,null,null,null,null,null,null,null,null,null,null,null,"                                                                 Sciences économiques",{"$f":"IF(QUIZ!L12=0,\"Score parfait !\",\"… avec  \"&QUIZ!L12&AR5)","v":"Score parfait !"}]
[]
[null,{"$f":"TRANSPOSE(Data!B2:E42)","v":"Gresham Thomas"},"Colbert Jean-Baptiste","Quesney François","Smith Adam","de Saint-Simon Henri","Malthus Thomas Robert","Say Jean-Baptiste","Ricardo David","de Sismondi Jean-Léonard","Bastiat Frédéric","Mill John Stuart","Proudhon Pierre-Joseph","Marx Karl","Walras Léon","Marshall Alfred","Pareto Vilfredo","Bernstein Eduard","Rist Charles","Keynes John Maynard","Schumpeter Joseph","Monnet Jean","Kondratiev Nikolaï","von Hayek Friedrich","Hicks John","Leontief Wassily","Fourastié Jean ","Kaldor Nicholas","Galbraith John Kenneth","Friedman Milton","Samuelson Paul Anthony","Tobin James","Klein Lawrence Robert ","Barre Raymond","Nash John Forbes","Sen Amartya","Lucas Robert Emerson","Yunus Muhammad","Laffer Arthur","Stiglitz Joseph","Piketty Thomas","   ",{"$error":"#N/A"}]
[null,"1519 Londres - 1579","1619 Reims - 1683 Paris","1694 Méré - Versailles 1774 ","1723 Écosse - Édimbourg 1790","1760 Paris - Paris 1854","1766 Surrey - Claverton, 1834","1767 Lyon  - Paris 1832","1772 Londres - Gloucestershire, 1823","1773 Genève  - id. 1842","1801 Bayonne - Rome 1850","1806 Londres - Avignon 1873","1809  Besançon - Paris 1865","1818 Trèves - Londres 1883","1834 Évreux - Clarens, Suisse, 1910","1842 Londres - Cambridge 1924","1848 Paris - Céligny, Suisse 1923","1850 Schöneberg - Berlin 1932","1874 Lausanne - Versailles 1955","1883 Cambridge - Sussex, 1946","1883 Moravie - Taconic,Connecticut 1950","1888 Cognac - Yvelines, 1979 ","1892 Vitchouga - Oblast de Moscou 1938 ","1899 Vienne - Frigourg-en-Brisgau 1992","1904 Warwick - Brockley 1989","1906 Munich - New-York 1999","1907 Saint-Bénin, Nièvre - Lot, 1990 ","1908 Budapest - 1986 Cambridge","1908 Iona Station, Ontario - Cambridge 2006","1912 New York - San Francisco 2006","1915 Gary, Indiana - Massachusetts 2009","1918 Champaing, Illinois - New Haven 2002","1920 Omaha, Nebraska - Gladwyne 2013","1924 Saint-Denis, Réunion - Paris 2007","1928 Bluefiel, Virginie - New Jersey 2015","1933 Santiniketan","1937 Yakima, État de Washington","1940 Chittagong, Bangladesh","1940 Youngstown, Ohio","1943 Gary","1971 Clichy","Date et lieu de naissance",{"$error":"#N/A"},{"$f":"IF(QUIZ!L12<2,\" hésitation!\",\" hésitations !\")","v":" hésitation!"}]
[null,"Commerçant et banquier anglais - Spécialise monétaire","Contrôleur général des finances","Chirurgien puis économiste français","Économiste britannique","Économiste et philosophe français","Économiste britannique","Économiste français","Économiste britannique","Historien et économiste suisse","Philosophe, magistrat et économistre français","Philosophe et économiste britannique","Économiste et philosophe français","Philosophe, économiste et homme politique allemand","Économiste français","Économiste britannique","Économiste et sociologue italien","Philosophe et homme politique allemand","Économiste français","Économiste britannique","Économiste autrichien.","Administrateur et homme politique français","Economiste soviétique","Économiste et philosophe autrichien (Prix Nobel en 1974)","Économiste britannique (Prix Nobel 1972)","Économiste américain d'origine russe. (Prix Nobel 1973)","Économiste français","Economiste hongrois","Économiste américain","Économiste américain. (Prix Nobel 1976)","Économiste américain. (Prix Nobel 1970)","Economistre américain (Prix Nobel 1981)","Économiste américain. (Prix Nobel 1980)","Économiste et homme politique français","Économiste et mathématicien américain (Prix Nobel 1994)","Économiste et philosophe indien (Prix Nobel 1998)","Économiste américain. (Prix Nobel 1995)","Entrepreneur et Économiste bangladais (Nobel de la paix 2005)","Économiste américain.","Économistre américain (Prix Nobel 2001)","Économiste français (Prix du meilleur jeune économiste)","    ",{"$error":"#N/A"}]
[null,"Mercantilisme","Mercantilisme","Physiocratie","Fondateur école classique","Utopistes","Classique","Classique","Classique","Classique","Classique","Utilitarisme - libéralisme","Utopistes","Marxisme","Néoclassique - Ecole de Lausanne","Néoclassique - Ecole anglaise","Néoclassique - Ecole de Lausanne","Marxisme","Néoclassique","Inspirateur du keynésianisme","Néoclassique - Ecole autrichienne","Libre échange","Léninisme","Ecole autrichienne","Néokeynésianisme","Empirisme","Libéralisme","Post-keynésianisme","Post-keynésianisme - Institutionnalisme","Néoclassique - Ecole de Chicago","Synthèse néoclassique","Synthèse néoclassique","Néokeynésianisme","Libéralisme","Synthèse néoclassique","Economistes du \"Bien-être\"","Nouvelle économie classique - Chicago","Économistes du \"Bien-être\"","Libéralisme - Ecole de l'offre","Néokeynésianisme","Sociale-démocratique","Ecole ou mouvement",{"$error":"#N/A"}]
[]
[null,null,"Fondateur de la doctrine économico-politique dite « colbertisme »","Fondateur de l'école des \"Physiocrates\"","Père de l'École classique et de l'économie moderne, Recherches sur la nature et les causes de la richesse des nations","Inspirateur et fondateur du mouvement du saint-simonisme","Essai sur le principe de population, démographie","Économie de l'offre, loi de Say","Théorie de la valeur, avantage comparatif, Des principes de l'économie politique et de l'impôt","Le « Réformiste hétérodoxe » : déséquilibres et crises de surproduction, le « garantisme social » : précurseur de la social-démocratie moderne","Sophismes économiques","Utilitarisme, un des économistes les plus influents du milieu du xixe siècle","Penseur libertaire : Théorie de l'exploitation, anti-propriété et anti-collectivisme, partisan du crédit gratuit, du mutualisme et du fédéralisme.","Fondateur de l'école marxiste, Le Capital","Cofondateur du marginalisme, équilibre général walrasien, tatonnement, commissaire-priseur walrasien","Principale figure de l'École néoclassique, valeur, Principes d'économie politique","École de Lausanne, optimum de Pareto, principe de Pareto",null,null,"Fondateur de la macroéconomie et du keynésianisme","Théorie de la croissance, rôle de l'entrepreneur et destruction créatrice, le « temps long » à l'œuvre dans l'évolution économique","Père de la planification à la française, un des inspirateurs actifs de l'Union Européenne","Cycle Kondratieff","Un des plus grands Autrichiens, cycle économique, ordre spontané, Nobel 1974","Fondateur du néo-keynésianisme avec le Modèle IS/LM, Nobel 1972","Analyse entrée-sortie, paradoxe de Leontief, Nobel 1973","Économiste du progrès technique et de la civilisation tertiaire (le Grand Espoir du XXe Siècle / Machinisme et Bien-être / les 40.000 heures[réf. souhaitée])","Carré magique","Keynésien et institutionnaliste, un des économistes les plus populaires du xxe siècle","Fondateur du monétarisme, Nobel 1976, JBC 1951","Synthèse néoclassique, Modèle Heckscher-Ohlin-Samuelson, théorème Stolper-Samuelson, Economics : an introductory analysis, JBC 1947, Nobel 1970","Analyse des marchés financiers (ratio q de Tobin), taxe Tobin, Nobel 1981, JBC 1955","Modèles macroéconomiques de pays, Nobel 1980",null,"Théorie des jeux, équilibre de Nash, Nobel 1994","Économie du bien-être, pauvreté, indicateur de développement humain, Nobel 1998","Nouvelle économie classique, anticipations rationnelles, Nobel 1995"]
[]
{"$rows_left_out":5}