{"text_format":"1","workbook":"xlsx","n_sheets":3,"sheets":["Quiz","Aide visuelle","Feuil2"],"not_rendered":{"charts":0,"images":94,"macros":1,"external_links":0,"defined_names":3,"comments":0,"pivot_tables":0},"unopened":[],"bounds":{"document_bytes":16777216,"sheet_cells":100000,"rows_first":2000,"rows_last":500,"rows_between":2000,"halvings":0,"cell_chars":16384,"cell_head_chars":4096},"cells_cut":0,"cells_raw":0,"read":"whole","date_system":"1900"}

{"sheet":"Quiz","index":0,"n_rows":98,"n_cols":17,"rows_kept":98,"cut":false,"hidden":false,"merged":[[3,3,4,3],[0,2,1,2],[3,2,4,2],[10,4,11,4]]}
[" ",null,null,{"$f":"I4","v":82},null,"<- Voir oiseau du menu"]
[null,null,null,{"$f":"I18","v":100},null,{"$f":"IF(J8=\"oui\",\"2 choix - Utilisez la gomme !\",\"\")","v":""}]
[null,null,null,null,{"$f":"IF(I4>81,\" \",\"Taille : \"&VLOOKUP(I4,Feuil2!A21:E106,4)&\" cm\")","v":" "}]
[null,{"$f":"IF(I4>I7,\"\",VLOOKUP(I4,Feuil2!A21:D93,3))","v":""},{"$f":"IF(K5=0,\"\",IF(I8=\"oui\",\"P\",\"O\"))","v":""},"Répondre en cliquant sur le nom d'un oiseau. La gomme annule votre choix et libère le tirage. Les flèches du haut font simplement défiler les volatiles sans attendre une réponse.",null,null,4,"Tirage / Menu",82,{"$f":"IF(J21=1,IF(I5=0,J6,I5),E4)","v":40}]
[null,{"$f":"IF(I4>I7,\"\",VLOOKUP(I4,Feuil2!A21:J93,9))","v":""},null,null,{"$f":"IF(I8=\"oui\",\"\",IF(OR(I21=1,I21=2),\"8\",\"?\"))","v":"8"},{"$f":"IF(I21>2,I16,\"\")","v":""},5,"Menu A /a+b",0,{"$f":"IF(I21=2,E4,SUM(I5:I6))","v":0},0]
[null,null,null,null,null,null,6,"Menu B ",0,{"$f":"I6+ 40","v":40},{"$f":"IF(I5=0,J6,I5)","v":40}]
[null,null,null,null,null,null,7,"nb oiseaux",80,0,{"$f":"\"< nouveau tirage\"","v":"< nouveau tirage"}]
[null,null,null,null,null,null,8,"Bonne réponse ",{"$f":"IF(I21=1,K35,IF(I4=J4,\"oui\",\"non\"))","v":"non"},{"$f":"IF(I5>0,IF(I6>0,\"oui\",\"non\"),\"non\")","v":"non"},{"$f":"IF(I5>0,IF(I6>0,\"oui\",\"non\"),\"non\")","v":"non"}]
[null,null," ",null,null,null,9,"Voir en défilant",false]
[null,null,null,null,null,null,10,"Voir stat / latin",false,false]
[null,null,null,null,null,null,11,"solution / famille",false,false]
[null,null,null,null,null,null,12,"nb rep",0,{"$f":"IF(INT((I12-I16)/5)<0,0,INT((I12-I16)/5))","v":0}]
[null,null,null,null,null,null,13,"nb juste",0,{"$f":"I13-I15","v":0}]
[null,null,null,null,null,null,14,"nb gomme",0,null,null,null,"     "]
[null,{"$f":"IF(I26=TRUE,\"Liste des tirages de cette partie :\",\"\")","v":""},null,null,null,null,15,"nb voir",0,null,null,null,null,"Lettres "]
[0,1,{"$f":"IF(A16=0,\"\",Q16&VLOOKUP(A16,Data,2))","v":""},null,null,null,16,"nb tir",0,100,null,null,null,null,{"$f":"IF(N16=\"\",\"\",N16&\" - \")","v":""},{"$f":"\"   (\"&A16&\")   -  \"","v":"   (0)   -  "},{"$f":"IF($I$21=1,O16,IF($I$21=4,P16,\"  \"))","v":"  "}]
[0,2,"",null,null,null,17,"évaluation",null,{"$f":"IF(I16=0,0,ROUND(J16*(I13-J12-J22)/(I16),0))","v":0},null,null,null,null,{"$f":"IF(N17=\"\",\"\",N17&\" - \")","v":""},{"$f":"\"   (\"&A17&\")   -  \"","v":"   (0)   -  "},{"$f":"IF($I$21=1,O17,IF($I$21=4,P17,\"  \"))","v":"  "}]
[0,3,"",null,null,null,18,"zoom",100,{"$f":"J17&\"/100\"","v":"0/100"},null,null,null,null,"","   (0)   -  ","  "]
[0,4,"",null,null,null,19,"Information",1,null,null,null,null,null,"","   (0)   -  ","  "]
[0,5,"",null,null,null,20,"grandeur",{"$f":"VLOOKUP(I4,Feuil2!A21:E105,4)*1.75","v":0},null,null,null,null,null,"","   (0)   -  ","  "]
[0,6,"",null,null,null,21,"1 no 2 sou  3 cla",2,{"$f":"IF(I21=2,1,0)","v":1},null,null,null,null,"","   (0)   -  ","  "]
[0,7,"",null,null,null,22,"nb indices",0,{"$f":"I22/4","v":0},null,null,null,null,"","   (0)   -  ","  "]
[0,8,"",null,null,null,23,null,null,null,null,null,null,null,"","   (0)   -  ","  "]
[0,9,"",null,null,null,24,"Position :",{"$f":"VLOOKUP(I4,Position,10)","v":0},"D",{"$f":"IF(I24=J24,1,0)","v":0},null,null,null,"","   (0)   -  ","  "]
[0,10,"",null,null,null,25,null,null,null,null,null,null,null,"","   (0)   -  ","  "]
[0,11,"",null,null,null,26,"Liste ;",false,null,null,null,null,null,"","   (0)   -  ","  "]
[0,12,"",null,null,null,27,null,null,null,null,null,null,null,"","   (0)   -  ","  "]
[0,13,"",null,null,null,28,null,null,null,null,null,null,null,"","   (0)   -  ","  "]
[0,14,"",null,null,null,29,null,null,null,null,null,null,null,"","   (0)   -  ","  "]
[0,15,"",null,null,null,30,"Tirage abcd",1,12,null,null,null,null,"","   (0)   -  ","  "]
[0,16,"",null,null,null,31,null,2,18,null,"selection",{"$f":"INDEX(I36:J40,M33,2)","v":{"$error":"#VALUE!"}},null,"","   (0)   -  ","  "]
[0,17,"",null,null,null,32,null,3,75,null,"rep menu",0,null,"","   (0)   -  ","  "]
[0,18,"",null,null,null,33,null,4,55,null,"rep ABCD",{"$f":"M32-1","v":-1},null,"","   (0)   -  ","  "]
[0,19,"",null,null,null,34,null,5,29,null,"v ABCD",{"$f":"MATCH(5,M36:M40,0)","v":1},null,"","   (0)   -  ","  "]
[0,20,"",null,null,null,35,null,"rang",null,{"$f":"IF(M35=1,\"oui\",\"non\")","v":"non"},null,{"$f":"IF(M33=M34,1,0)","v":0},null,"","   (0)   -  ","  "]
[0,21,"",null,null,null,36,"A",{"$f":"RANK(J30,$J$30:$J$34)","v":5},{"$f":"VLOOKUP(I36,$I$30:$J$34,2)","v":29},1,{"$f":"IF($I$4>80,\"\",\"A   \"&VLOOKUP(J36,Feuil2!$A$20:$B$100,2))","v":""},{"$f":"I36","v":5},null,"","   (0)   -  ","  "]
[0,22,"",null,null,null,37,"B",{"$f":"RANK(J31,$J$30:$J$34)","v":4},{"$f":"VLOOKUP(I37,$I$30:$J$34,2)","v":55},2,{"$f":"IF($I$4>80,\"\",\"B   \"&VLOOKUP(J37,Feuil2!$A$20:$B$100,2))","v":""},{"$f":"I37","v":4},null,"","   (0)   -  ","  "]
[0,23,"",null,null,null,38,"C",1,12,3,{"$f":"IF($I$4>80,\"\",\"C   \"&VLOOKUP(J38,Feuil2!$A$20:$B$100,2))","v":""},1,null,"","   (0)   -  ","  "]
[0,24,"",null,null,null,39,"D",2,18,4,{"$f":"IF($I$4>80,\"\",\"D   \"&VLOOKUP(J39,Feuil2!$A$20:$B$100,2))","v":""},2,null,"","   (0)   -  ","  "]
[0,25,"",null,null,null,40,"E",3,75,5,{"$f":"IF($I$4>80,\"\",\"E   \"&VLOOKUP(J40,Feuil2!$A$20:$B$100,2))","v":""},3,null,"","   (0)   -  ","  "]
[0,26,"",null,null,null,41,null,null,null,"lettre juste",{"$f":"VLOOKUP(M34+35,G36:H40,2)","v":"A"},null,null,"","   (0)   -  ","  "]
[0,27,"",null,null,null,null,null,null,null,null,null,null,null,"","   (0)   -  ","  "]
[0,28,"",null,null,null,null,null,null,null,null,null,null,null,"","   (0)   -  ","  "]
[0,29,"",null,null,null,null,null,null,null,null,null,null,null,"","   (0)   -  ","  "]
[0,30,"",null,null,null,null,null,null,null,null,null,null,null,"","   (0)   -  ","  "]
[0,31,"",null,null,null,null,null,null,null,null,null,null,null,"","   (0)   -  ","  "]
[0,32,"",null,null,null,null,null,null,null,null,null,null,null,"","   (0)   -  ","  "]
[0,33,{"$f":"IF(A48=0,\"\",Q48&VLOOKUP(A48,Data,2))","v":""},null,null,null,null,null,null,null,null,null,null,null,"","   (0)   -  ","  "]
[0,34,"",null,null,null,null,null,null,null,null,null,null,null,"","   (0)   -  ","  "]
[0,35,"",null,null,null,null,null,null,null,null,null,null,null,"","   (0)   -  ","  "]
[0,36,"",null,null,null,null,null,null,null,null,null,null,null,"","   (0)   -  ","  "]
[0,37,"",null,null,null,null,null,null,null,null,null,null,null,"","   (0)   -  ","  "]
[0,38,"",null,null,null,null,null,null,null,null,null,null,null,"","   (0)   -  ","  "]
[0,39,"",null,null,null,null,null,null,null,null,null,null,null,"","   (0)   -  ","  "]
[0,40,"",null,null,null,null,null,null,null,null,null,null,null,"","   (0)   -  ","  "]
[0,41,"",null,null,null,null,null,null,null,null,null,null,null,"","   (0)   -  ","  "]
[0,42,"",null,null,null,null,null,null,null,null,null,null,null,"","   (0)   -  ","  "]
[0,43,"",null,null,null,null,null,null,null,null,null,null,null,"","   (0)   -  ","  "]
[0,44,"",null,null,null,null,null,null,null,null,null,null,null,"","   (0)   -  ","  "]
[0,45,"",null,null,null,null,null,null,null,null,null,null,null,"","   (0)   -  ","  "]
[0,46,"",null,null,null,null,null,null,null,null,null,null,null,"","   (0)   -  ","  "]
[0,47,"",null,null,null,null,null,null,null,null,null,null,null,"","   (0)   -  ","  "]
[0,48,"",null,null,null,null,null,null,null,null,null,null,null,"","   (0)   -  ","  "]
[0,49,"",null,null,null,null,null,null,null,null,null,null,null,"","   (0)   -  ","  "]
[0,50,"",null,null,null,null,null,null,null,null,null,null,null,"","   (0)   -  ","  "]
[0,51,"",null,null,null,null,null,null,null,null,null,null,null,"","   (0)   -  ","  "]
[0,52,"",null,null,null,null,null,null,null,null,null,null,null,"","   (0)   -  ","  "]
[0,53,"",null,null,null,null,null,null,null,null,null,null,null,"","   (0)   -  ","  "]
[0,54,"",null,null,null,null,null,null,null,null,null,null,null,"","   (0)   -  ","  "]
[0,55,"",null,null,null,null,null,null,null,null,null,null,null,"","   (0)   -  ","  "]
[0,56,"",null,null,null,null,null,null,null,null,null,null,null,"","   (0)   -  ","  "]
[0,57,"",null,null,null,null,null,null,null,null,null,null,null,"","   (0)   -  ","  "]
[0,58,"",null,null,null,null,null,null,null,null,null,null,null,"","   (0)   -  ","  "]
[0,59,"",null,null,null,null,null,null,null,null,null,null,null,"","   (0)   -  ","  "]
[0,60,"",null,null,null,null,null,null,null,null,null,null,null,"","   (0)   -  ","  "]
[0,61,"",null,null,null,null,null,null,null,null,null,null,null,"","   (0)   -  ","  "]
[0,62,"",null,null,null,null,null,null,null,null,null,null,null,"","   (0)   -  ","  "]
[0,63,"",null,null,null,null,null,null,null,null,null,null,null,"","   (0)   -  ","  "]
[0,64,"",null,null,null,null,null,null,null,null,null,null,null,"","   (0)   -  ","  "]
[0,65,{"$f":"IF(A80=0,\"\",Q80&VLOOKUP(A80,Data,2))","v":""},null,null,null,null,null,null,null,null,null,null,null,"","   (0)   -  ","  "]
{"$rows_left_out":19}
{"sheet":"Aide visuelle","index":1,"n_rows":110,"n_cols":1,"rows_kept":110,"cut":false,"hidden":false,"merged":[]}
[]
[]
[]
[]
[]
[]
[]
[]
[]
[]
[]
[]
[]
[]
[]
[]
[]
[]
[]
[]
[]
[]
[]
[]
[]
[]
[]
[]
[]
[]
[]
[]
[]
[]
[]
[]
[]
[]
[]
[]
[]
[]
[]
[]
[]
[]
[]
[]
[]
[]
[]
[]
[]
[]
[]
[]
[]
[]
[]
[]
[]
[]
[]
[]
[]
[]
[]
[]
[]
[]
[]
[]
[]
[]
[]
[]
[]
[]
[]
[]
{"$rows_left_out":31}
{"sheet":"Feuil2","index":2,"n_rows":104,"n_cols":99,"rows_kept":104,"cut":false,"hidden":true,"merged":[]}
[null,1,2,3,4,5,6,7,8,9,10,11,12,13,14,15,16,17,18,19,20,21,22,23,24,25,26,27,28,29,30,31,32,33,34,35,36,37,38,39,40,41,42,43,44,45,46,47,48,49,50,51,52,53,54,55,56,57,58,59,60,61,62,63,64,65,66,67,68,69,70,71,72,73,74,75,76,77,78,79,80,81,82,83,84,85,87,88,89,90,91,92,93,94,95,96,97,89,90]
[null,null,null,null,null,null,null,null,null,null,null,null,null,null,null,null,null,null,null,null,null,null,null,null,null,null,null,null,null,null,null,null,null,null,null,null,null,null,null,null,null,null,null,null,null,null,null,null,null,null,null,null,null,null,null,null,null,null,null,null,null,null,null,null,null,null,null,null,null,null,null,null,null,null,null,null,null,null,null,null,null,null,"        Bienvenue dans le QUIZ ornithologique.                                                                                              Cliquez sur un oiseau pour  afficher  une nouvelle espèce ! (ou Ctrl + q)","             Tous les oiseaux ont été vues…                  Bravo !"]
[]
[null,"Aigle royal","Aigrette garzette","Alouette des champs","Barge rousse","Bécasse des bois","Bergeronnette printanière","Bergeronnette grise","Bouvreuil pivoine","Bruant rustique","Buse variable","Caille des blés","Canard colvert","Cassenoix moucheté","Chardonneret élégant","Chevalier stagnatile","Chocard à bec jaune","Chouette hulotte","Cigogne blanche","Corbeau freux","Cormoran (grand)","Corneille noire","Coucou gris","Épervier d'Europe","Étourneau sansonnet","Faisan de Colchide","Faucon crécerellette","Fauvette des jardins","Fou de Bassan","Foulque macroule","Geai des chênes","Gobemouche noir","Goéland argenté","Grand Tétras","Grand-duc d'Europe","Grèbe huppé","Grive musicienne","Grosbec casse-noyaux","Grue cendrée","Guêpier d'Europe","Gypaète barbu","Héron cendré","Hirondelle rustique","Huppe fasciée","Lagopède alpin","Linotte mélodieuse","Loriot d'Europe","Martinet noir","Martin-pêcheur d'Europe","Merle noir","Mésange bleue","Mésange charbonnière","Mésange huppée","Mésange noire","Mésange nonnette","Milan royal","Moineau domestique","Mouettes rieuse","Pélican blanc","Perdrix bartavelle","Petit-duc scops","Pic épeiche","Pic noir","Pie bavarde","Pie-grièche à tête rousse","Pigeon ramier","Pinson du Nord","Pouillot à grands sourcils","Roitelet à triple bandeau","Rossignol péhilomèle","Rougegorge familier","Rougequeue noir","Rousserolle effarvatte","Sarcelle d'hiver","Serin cini","Sittelle torchepot","Spatule blanche","Tarin des aulnes","Tourterelle turque","Troglodyte mignon","Vautour fauve","    ","   ","   ","    ","    ","    ","    ","    "]
[null,"Milans, Vautours, Buses","Hérons, Butors","Alouettes","Chevaliers et Bécasseaux","Chevaliers et Bécasseaux","Pipits et Bergeronnettes","Pipits et Bergeronnettes","Fringilles","Bruants","Milans, Vautours, Buses","Faisans","Canards, Oies et Cygnes","Corvidés","Fringilles","Chevaliers et Bécasseaux","Corvidés","Chouettes et Hiboux","Cigognes","Corvidés","Cormorans","Corvidés","Coucous","Milans, Vautours, Buses","Étourneaux","Faisans","Faucons","Fauvettes et alliés","Fous","Râles et Foulques","Corvidés","Gobemouches","Mouettes et Goélands","Tétras","Chouettes et Hiboux","Grèbes","Merles, Grives et Traquets","Fringilles","Grues","Guêpiers","Milans, Vautours, Buses","Hérons, Butors","Hirondelles","Huppes","Tétras","Fringilles","Loriots","Martinets","Martins-pêcheurs","Merles, Grives et Traquets","Mésanges","Mésanges","Mésanges","Mésanges","Mésanges","Milans, Vautours, Buses","Moineaux","Mouettes et Goélands","Pélicans","Faisans","Chouettes et hiboux","Pics","Pics","Corvidés","Pies-grièches","Pigeons et Tourterelles","Fringilles","Fauvettes","Fauvettes","Merles, Grives et Traquets","Merles, Grives et Traquets","Merles, Grives et Traquets","Fauvettes et alliés","Canards, Oies et Cygnes","Fringilles","Sittelles","Spatules","Fringilles","Pigeons et Tourterelles","Trpglodyte","Milans, Vautours, Buses","   ","   ","   ","   ","   ","   ","   ","   "]
[null,{"$f":"AVERAGE(B$7:B$8)","v":81.5},{"$f":"AVERAGE(C$7:C$8)","v":60},{"$f":"AVERAGE(D$7:D$8)","v":18.5},37,{"$f":"AVERAGE(F$7:F$8)","v":34},{"$f":"AVERAGE(G$7:G$8)","v":17},{"$f":"AVERAGE(H$7:H$8)","v":18},{"$f":"AVERAGE(I$7:I$8)","v":13.5},{"$f":"AVERAGE(J$7:J$8)","v":13.5},{"$f":"AVERAGE(K$7:K$8)","v":53.5},17,57.5,32.5,12.5,23.5,37.5,38,107.5,45,87,47.5,33,{"$f":"AVERAGE(X$7:X$8)","v":33},{"$f":"AVERAGE(Y$7:Y$8)","v":20.5},72.5,30,13.5,77.5,37,33.5,12.5,57,73.5,67.5,{"$f":"AVERAGE(AJ$7:AJ$8)","v":48.5},{"$f":"AVERAGE(AK$7:AK$8)","v":22.5},{"$f":"AVERAGE(AL$7:AL$8)","v":17.5},{"$f":"AVERAGE(AM$7:AM$8)","v":107.5},28,107.5,{"$f":"AVERAGE(AP$7:AP$8)","v":94},{"$f":"AVERAGE(AQ$7:AQ$8)","v":19},{"$f":"AVERAGE(AR$7:AR$8)","v":27},35,13.5,23.5,{"$f":"AVERAGE(AV$7:AV$8)","v":16.5},{"$f":"AVERAGE(AW$7:AW$8)","v":16.5},26.5,{"$f":"AVERAGE(AY$7:AY$8)","v":11.5},14.5,11.5,11,12.5,64.5,14.5,35.5,{"$f":"AVERAGE(BG$7:BG$8)","v":157.5},33.5,19.5,{"$f":"AVERAGE(BJ$7:BJ$8)","v":22.5},{"$f":"AVERAGE(BK$7:BK$8)","v":43},45.5,18,41,15,9.5,9.5,16,{"$f":"AVERAGE(BS$7:BS$8)","v":13},14,13,36,11.5,14,86.5,11.5,32,9.5,102.5,0,0,0,"    ","    ","    ","    ","    ",null,null,null,null,null,{"$f":"AVERAGE(CQ$7:CQ$8)","v":{"$error":"#DIV/0!"}}]
[null,75,55,18,33,33,16,17,13,13,50,16,50,32,12,22,36,37,100,41,84,44,32,28,19,55,27,13,58,36,32,12,54,60,60,46,21,17,96,27,100,90,17,26,34,13,22,16,16,24,11,14,11,10,12,56,14,34,140,32,19,22,40,40,17,40,14,9,9,15,12,13,12,34,11,13,80,11,31,9,95,0,0,0,"   ","   ","   ","   ","   "]
[null,88,65,19,41,35,18,19,14,14,57,18,65,33,13,25,39,39,115,49,90,51,34,38,22,90,33,14,97,38,35,13,60,87,75,51,24,18,119,29,115,98,21,28,36,14,25,17,17,29,12,15,12,12,13,73,15,37,175,35,20,23,46,51,19,42,16,10,10,17,14,15,14,38,12,15,93,12,33,10,110,0,0,0,"   ","   ","   ","   ","   "]
[null,"D","D","D","D","G","G","G","D","G","D","G","G","G","G","G","D","D","G","G","D","D","G","G","D","D","G","G","D","G","G","G","D","D","D","D","D","G","D","D","G","D","D","G","G","D","G","D","D","D","G","D","G","D","G","D","G","G","G","D","D","G","G","D","G","G","D","D","D","G","G","D","D","D","D","D","G","D","D","G","G","   ","   ","   ","   ","   ","   ","   ","   "]
[null,null,null,null,null,null,null,null,null,null,null,null,null,null,null,null,null,null,null,null,null,null,null,null,null,null,null,null,null,null,null,null,null,null,null,null,null,null,null,null,null,null,null,null,null,null,null,null,null,null,null,null,null,null,null,null,null,null,null,null,null,null,null,null,null,null,null,null,null,null,null,null,null,null,null,null,null,null,null,null,null,null,"   ","   "]
[]
[]
[]
[]
[]
[]
[]
["https://www.vogelwarte.ch/fr/oiseaux/les-oiseaux-de-suisse/"]
[]
[null,"Nom","Groupe","moyenne",null,null,null,null,null,"Gaude-Droite"]
[1,{"$f":"TRANSPOSE(B4:CG6)","v":"Aigle royal"},"Milans, Vautours, Buses",81.5,{"$f":"A21&\"    \"&B21","v":"1    Aigle royal"},{"$f":"\"A\"","v":"A"},{"$f":"F21&\"       \"&B21","v":"A       Aigle royal"},{"$f":"\"      \"&A21","v":"      1"},"A, B, C",{"$f":"TRANSPOSE(B9:CC9)","v":"D"}]
[2,"Aigrette garzette","Hérons, Butors",60,{"$f":"A22&\"    \"&B22","v":"2    Aigrette garzette"},{"$f":"\"   \"","v":"   "},{"$f":"F22&\"      \"&B22","v":"         Aigrette garzette"},{"$f":"\"      \"&A22","v":"      2"},"A, B, C","D"]
[3,"Alouette des champs","Alouettes",18.5,"3    Alouette des champs",{"$f":"\"   \"","v":"   "},{"$f":"F23&\"      \"&B23","v":"         Alouette des champs"},"      3","A, B, C","D"]
[4,"Barge rousse","Chevaliers et Bécasseaux",37,"4    Barge rousse",{"$f":"\"B  \"","v":"B  "},{"$f":"F24&\"     \"&B24","v":"B       Barge rousse"},"      4","A, B, C","D"]
[5,"Bécasse des bois","Chevaliers et Bécasseaux",34,"5    Bécasse des bois",{"$f":"\"    \"","v":"    "},"         Bécasse des bois","      5","A, B, C","G"]
[6,"Bergeronnette printanière","Pipits et Bergeronnettes",17,"6    Bergeronnette printanière","    ","         Bergeronnette printanière","      6","A, B, C","G"]
[7,"Bergeronnette grise","Pipits et Bergeronnettes",18,"7    Bergeronnette grise","    ","         Bergeronnette grise","      7","A, B, C","G"]
[8,"Bouvreuil pivoine","Fringilles",13.5,"8    Bouvreuil pivoine","    ","         Bouvreuil pivoine","      8","A, B, C","D"]
[9,"Bruant rustique","Bruants",13.5,"9    Bruant rustique","    ","         Bruant rustique","      9","A, B, C","G"]
[10,"Buse variable","Milans, Vautours, Buses",53.5,"10    Buse variable","    ","         Buse variable","      10","A, B, C","D"]
[11,"Caille des blés","Faisans",17,"11    Caille des blés",{"$f":"\"C\"","v":"C"},{"$f":"F31&\"      \"&B31","v":"C      Caille des blés"},"      11","A, B, C","G"]
[12,"Canard colvert","Canards, Oies et Cygnes",57.5,"12    Canard colvert",{"$f":"\"    \"","v":"    "},"         Canard colvert","      12","A, B, C","G"]
[13,"Cassenoix moucheté","Corvidés",32.5,"13    Cassenoix moucheté","    ","         Cassenoix moucheté","      13","A, B, C","G"]
[14,"Chardonneret élégant","Fringilles",12.5,"14    Chardonneret élégant","    ","         Chardonneret élégant","      14","A, B, C","G"]
[15,"Chevalier stagnatile","Chevaliers et Bécasseaux",23.5,"15    Chevalier stagnatile","    ","         Chevalier stagnatile","      15","A, B, C","G"]
[16,"Chocard à bec jaune","Corvidés",37.5,"16    Chocard à bec jaune","    ","         Chocard à bec jaune","      16","A, B, C","D"]
[17,"Chouette hulotte","Chouettes et Hiboux",38,"17    Chouette hulotte","    ","         Chouette hulotte","      17","A, B, C","D"]
[18,"Cigogne blanche","Cigognes",107.5,"18    Cigogne blanche","    ","         Cigogne blanche","      18","A, B, C","G"]
[19,"Corbeau freux","Corvidés",45,"19    Corbeau freux","    ","         Corbeau freux","      19","A, B, C","G"]
[20,"Cormoran (grand)","Cormorans",87,"20    Cormoran (grand)","    ","         Cormoran (grand)","      20","A, B, C","D"]
[21,"Corneille noire","Corvidés",47.5,"21    Corneille noire","    ","         Corneille noire","      21","A, B, C","D"]
[22,"Coucou gris","Coucous",33,"22    Coucou gris","    ","         Coucou gris","      22","A, B, C","G"]
[23,"Épervier d'Europe","Milans, Vautours, Buses",33,"23    Épervier d'Europe",{"$f":"\"E\"","v":"E"},{"$f":"F43&\"       \"&B43","v":"E       Épervier d'Europe"},"      23","D, E, F","G"]
[24,"Étourneau sansonnet","Étourneaux",20.5,"24    Étourneau sansonnet","    ","         Étourneau sansonnet","      24","D, E, F","D"]
[25,"Faisan de Colchide","Faisans",72.5,"25    Faisan de Colchide",{"$f":"\"F\"","v":"F"},{"$f":"F45&\"       \"&B45","v":"F       Faisan de Colchide"},"      25","D, E, F","D"]
[26,"Faucon crécerellette","Faucons",30,"26    Faucon crécerellette",{"$f":"\"    \"","v":"    "},"         Faucon crécerellette","      26","D, E, F","G"]
[27,"Fauvette des jardins","Fauvettes et alliés",13.5,"27    Fauvette des jardins","    ","         Fauvette des jardins","      27","D, E, F","G"]
[28,"Fou de Bassan","Fous",77.5,"28    Fou de Bassan","    ","         Fou de Bassan","      28","D, E, F","D"]
[29,"Foulque macroule","Râles et Foulques",37,"29    Foulque macroule","    ","         Foulque macroule","      29","D, E, F","G"]
[30,"Geai des chênes","Corvidés",33.5,"30    Geai des chênes",{"$f":"\"G\"","v":"G"},"G     Geai des chênes","      30","G, H, I","G"]
[31,"Gobemouche noir","Gobemouches",12.5,"31    Gobemouche noir",{"$f":"\"   \"","v":"   "},"        Gobemouche noir","      31","G, H, I","G"]
[32,"Goéland argenté","Mouettes et Goélands",57,"32    Goéland argenté","   ","        Goéland argenté","      32","G, H, I","D"]
[33,"Grand Tétras","Tétras",73.5,"33    Grand Tétras","   ","        Grand Tétras","      33","G, H, I","D"]
[34,"Grand-duc d'Europe","Chouettes et Hiboux",67.5,"34    Grand-duc d'Europe","   ","        Grand-duc d'Europe","      34","G, H, I","D"]
[35,"Grèbe huppé","Grèbes",48.5,"35    Grèbe huppé","   ","        Grèbe huppé","      35","G, H, I","D"]
[36,"Grive musicienne","Merles, Grives et Traquets",22.5,"36    Grive musicienne","   ","        Grive musicienne","      36","G, H, I","D"]
[37,"Grosbec casse-noyaux","Fringilles",17.5,"37    Grosbec casse-noyaux","   ","        Grosbec casse-noyaux","      37","G, H, I","G"]
[38,"Grue cendrée","Grues",107.5,"38    Grue cendrée","   ","        Grue cendrée","      38","G, H, I","D"]
[39,"Guêpier d'Europe","Guêpiers",28,"39    Guêpier d'Europe","   ","        Guêpier d'Europe","      39","G, H, I","D"]
[40,"Gypaète barbu","Milans, Vautours, Buses",107.5,"40    Gypaète barbu","   ","        Gypaète barbu","      40","G, H, I","G"]
[41,"Héron cendré","Hérons, Butors",94,"41    Héron cendré",{"$f":"\"H\"","v":"H"},"H     Héron cendré","      41","G, H, I","D"]
[42,"Hirondelle rustique","Hirondelles",19,"42    Hirondelle rustique",{"$f":"\"   \"","v":"   "},"        Hirondelle rustique","      42","G, H, I","D"]
[43,"Huppe fasciée","Huppes",27,"43    Huppe fasciée",{"$f":"\"   \"","v":"   "},"        Huppe fasciée","      43","G, H, I","G"]
[44,"Lagopède alpin","Tétras",35,"44    Lagopède alpin",{"$f":"\"L\"","v":"L"},{"$f":"F64&\"      \"&B64","v":"L      Lagopède alpin"},"      44","L, M, N","G"]
[45,"Linotte mélodieuse","Fringilles",13.5,"45    Linotte mélodieuse",{"$f":"\"   \"","v":"   "},"        Linotte mélodieuse","      45","L, M, N","D"]
[46,"Loriot d'Europe","Loriots",23.5,"46    Loriot d'Europe","   ","        Loriot d'Europe","      46","L, M, N","G"]
[47,"Martinet noir","Martinets",16.5,"47    Martinet noir",{"$f":"\"M\"","v":"M"},{"$f":"F67&\"    \"&B67","v":"M    Martinet noir"},"      47","L, M, N","D"]
[48,"Martin-pêcheur d'Europe","Martins-pêcheurs",16.5,"48    Martin-pêcheur d'Europe",{"$f":"\"   \"","v":"   "},"        Martin-pêcheur d'Europe","      48","L, M, N","D"]
[49,"Merle noir","Merles, Grives et Traquets",26.5,"49    Merle noir","   ","        Merle noir","      49","L, M, N","D"]
[50,"Mésange bleue","Mésanges",11.5,"50    Mésange bleue","   ","        Mésange bleue","      50","L, M, N","G"]
[51,"Mésange charbonnière","Mésanges",14.5,"51    Mésange charbonnière","   ","        Mésange charbonnière","      51","L, M, N","D"]
[52,"Mésange huppée","Mésanges",11.5,"52    Mésange huppée","   ","        Mésange huppée","      52","L, M, N","G"]
[53,"Mésange noire","Mésanges",11,"53    Mésange noire","   ","        Mésange noire","      53","L, M, N","D"]
[54,"Mésange nonnette","Mésanges",12.5,"54    Mésange nonnette","   ","        Mésange nonnette","      54","L, M, N","G"]
[55,"Milan royal","Milans, Vautours, Buses",64.5,"55    Milan royal","   ","        Milan royal","      55","L, M, N","D"]
[56,"Moineau domestique","Moineaux",14.5,"56    Moineau domestique","   ","        Moineau domestique","      56","L, M, N","G"]
[57,"Mouettes rieuse","Mouettes et Goélands",35.5,"57    Mouettes rieuse","   ","        Mouettes rieuse","      57","L, M, N","G"]
[58,"Pélican blanc","Pélicans",157.5,"58    Pélican blanc",{"$f":"\"P\"","v":"P"},{"$f":"F78&\"      \"&B78","v":"P      Pélican blanc"},"      58","P, Q, R","G"]
[59,"Perdrix bartavelle","Faisans",33.5,"59    Perdrix bartavelle",{"$f":"\"   \"","v":"   "},"        Perdrix bartavelle","      59","P, Q, R","D"]
[60,"Petit-duc scops","Chouettes et hiboux",19.5,"60    Petit-duc scops","   ","        Petit-duc scops","      60","P, Q, R","D"]
{"$rows_left_out":24}