{"text_format":"3","workbook":"xlsx","n_sheets":5,"sheets":["  Q U I Z  ","Consignes","Version papier","Données","Galerie"],"not_rendered":{"images":60,"macros":1,"external_links":2,"defined_names":10},"read":"whole","date_system":"1900"}

{"sheet":"  Q U I Z  ","index":0,"n_rows":62,"n_cols":21,"rows_kept":62,"merged":[[1,8,7,9],[2,1,3,1],[2,3,4,7],[2,10,3,10],[5,1,6,1],[5,10,6,10],[6,4,7,7],[7,2,11,3],[8,1,9,1],[8,8,8,9],[8,10,9,10],[10,5,11,8],[11,1,12,1],[11,10,12,10],[12,3,15,3],[14,1,15,1],[14,10,15,10],[15,5,16,8],[16,2,19,3],[18,1,19,1],[18,10,19,10],[19,5,20,8],[20,3,23,4],[21,1,22,1],[21,10,22,10],[24,1,25,1],[24,2,24,3],[24,10,25,10],[25,5,27,7],[26,3,27,3],[27,1,29,1],[27,10,29,10]]}
[{"$nulls":17},0,{"$f":"IF(R1<$Q$15+1,VLOOKUP(R1,Données!G4:H20,2),0)","v":0},{"$f":"5","v":5}]
[{"$nulls":16},"Comp. questions",1,{"$f":"IF(R2<$Q$15+1,VLOOKUP(R2,Données!G5:H21,2),0)","v":1},{"$f":"5","v":5},{"$f":"IF(T2=S2,1,0)","v":0}]
[null,"S",null,{"$f":"VLOOKUP(C5,Données!A4:F60,2)","v":"Cliquer sur ma tête pour obtenir une question sur le Code pénal"},{"$nulls":6},"S",{"$nulls":5},0,2,{"$f":"IF(R3<$Q$15+1,VLOOKUP(R3,Données!G6:H22,2),0)","v":3},{"$f":"5","v":5},{"$f":"IF(T3=S3,1,0)","v":0}]
[{"$nulls":17},3,{"$f":"IF(R4<$Q$15+1,VLOOKUP(R4,Données!G7:H23,2),0)","v":4},{"$f":"5","v":5},0]
[null,null,0,{"$nulls":13},"Comp. réponses",4,{"$f":"IF(R5<$Q$15+1,VLOOKUP(R5,Données!G8:H24,2),0)","v":3},{"$f":"5","v":5},0]
[null,"U",{"$nulls":8},"U",{"$nulls":5},0,5,{"$f":"IF(R6<$Q$15+1,VLOOKUP(R6,Données!G9:H25,2),0)","v":4},{"$f":"5","v":5},0]
[{"$nulls":4},{"$f":"VLOOKUP($C$5,Données!$A$4:$F$60,3)","v":"Salut, mon nom est Madona"},{"$nulls":12},6,{"$f":"IF(R7<$Q$15+1,VLOOKUP(R7,Données!G10:H26,2),0)","v":2},{"$f":"5","v":5},0]
[{"$nulls":16},"Réponse choisie",7,{"$f":"IF(R8<$Q$15+1,VLOOKUP(R8,Données!G11:H27,2),0)","v":4},{"$f":"5","v":5},0]
[null,"P",{"$nulls":6},"           Cliquez sur les visages !     ",null,"P",{"$nulls":5},0,8,{"$f":"IF(R9<$Q$15+1,VLOOKUP(R9,Données!G12:H28,2),0)","v":3},{"$f":"5","v":5},0]
[{"$nulls":17},9,{"$f":"IF(R10<$Q$15+1,VLOOKUP(R10,Données!G13:H29,2),0)","v":3},{"$f":"5","v":5},0]
[{"$nulls":5},{"$f":"VLOOKUP($C$5,Données!$A$4:$F$60,4)","v":" Moi, je m'appelle Vanessa"},{"$nulls":10},"Nb rép. justes",10,{"$f":"IF(R11<$Q$15+1,VLOOKUP(R11,Données!G14:H30,2),0)","v":1},{"$f":"5","v":5},0]
[null,"E",{"$nulls":8},"E",{"$nulls":5},{"$f":"SUM(U1:U62)","v":0},11,{"$f":"IF(R12<$Q$15+1,VLOOKUP(R12,Données!G15:H31,2),0)","v":1},{"$f":"5","v":5},0]
[{"$nulls":17},12,{"$f":"IF(R13<$Q$15+1,VLOOKUP(R13,Données!G16:H32,2),0)","v":2},{"$f":"5","v":5},0]
[{"$nulls":16},"Nb de questions",13,{"$f":"IF(R14<$Q$15+1,VLOOKUP(R14,Données!G17:H33,2),0)","v":4},{"$f":"5","v":5},0]
[null,"R",{"$nulls":8},"R",{"$nulls":5},{"$f":"Données!A3","v":20},14,{"$f":"IF(R15<$Q$15+1,VLOOKUP(R15,Données!G18:H34,2),0)","v":1},{"$f":"5","v":5},0]
[{"$nulls":5},{"$f":"VLOOKUP($C$5,Données!$A$4:$F$60,5)","v":"... et moi George"},{"$nulls":11},15,{"$f":"IF(R16<$Q$15+1,VLOOKUP(R16,Données!G19:H35,2),0)","v":2},{"$f":"5","v":5},0]
[{"$nulls":16},"Q'une réponse",16,{"$f":"IF(R17<$Q$15+1,VLOOKUP(R17,Données!G20:H36,2),0)","v":1},{"$f":"5","v":5},0]
[{"$nulls":16},false,17,{"$f":"IF(R18<$Q$15+1,VLOOKUP(R18,Données!G21:H37,2),0)","v":2},{"$f":"5","v":5},0]
[null,"Q",{"$nulls":8},"Q",{"$nulls":5},{"$f":"IF(Q18=TRUE,1,0)","v":0},18,{"$f":"IF(R19<$Q$15+1,VLOOKUP(R19,Données!G22:H38,2),0)","v":4},{"$f":"5","v":5},0]
[{"$nulls":5},{"$f":"VLOOKUP($C$5,Données!$A$4:$F$60,6)","v":"Hello, je suis Britney"},{"$nulls":11},19,{"$f":"IF(R20<$Q$15+1,VLOOKUP(R20,Données!G23:H39,2),0)","v":3},{"$f":"5","v":5},0]
[{"$nulls":15},"R =","No question",20,{"$f":"IF(R21<$Q$15+1,VLOOKUP(R21,Données!G24:H40,2),0)","v":4},{"$f":"5","v":5},0]
[null,"U",{"$nulls":8},"U",{"$nulls":4},"S =","Rép. Juste",21,{"$f":"IF(R22<$Q$15+1,VLOOKUP(R22,Données!G25:H41,2),0)","v":0},{"$f":"5","v":5},0]
[{"$nulls":15},"T =","Rép. Donnée",22,{"$f":"IF(R23<$Q$15+1,VLOOKUP(R23,Données!G26:H42,2),0)","v":0},{"$f":"5","v":5},0]
[{"$nulls":15},"U =","0 faux - 1 juste",23,{"$f":"IF(R24<$Q$15+1,VLOOKUP(R24,Données!G27:H43,2),0)","v":0},{"$f":"5","v":5},0]
[null,"I",{"$f":"IF(Q9=0,\"\",\"Proposition de \" & VLOOKUP(Q9,Consignes!C20:E23,2))","v":""},{"$nulls":7},"I",{"$nulls":6},24,{"$f":"IF(R25<$Q$15+1,VLOOKUP(R25,Données!G28:H44,2),0)","v":0},{"$f":"5","v":5},0]
[{"$nulls":5},{"$f":"IF(Q9=0,\"\",VLOOKUP(C5,Données!G4:L60,Q9+2))","v":""},{"$nulls":11},25,{"$f":"IF(R26<$Q$15+1,VLOOKUP(R26,Données!G29:H45,2),0)","v":0},{"$f":"5","v":5},0]
[{"$nulls":3},{"$f":"IF(Q9=0,\"\",IF(Q9=VLOOKUP(C5,Données!G2:L60,2),\"JUSTE\",\"FAUX\"))","v":""},{"$nulls":13},26,{"$f":"IF(R27<$Q$15+1,VLOOKUP(R27,Données!G30:H46,2),0)","v":0},{"$f":"5","v":5},0]
[null,"Z",{"$nulls":6},"Justes :",{"$f":"Q12&\" / \"&Données!A3","v":"0 / 20"},"Z",{"$nulls":6},27,{"$f":"IF(R28<$Q$15+1,VLOOKUP(R28,Données!G31:H47,2),0)","v":0},{"$f":"5","v":5},0]
[{"$nulls":19},{"$f":"5","v":5}]
[{"$nulls":8},"Questions posées :",{"$f":"IF(C5=Q123+1,Q3-1,Q3)","v":0},{"$nulls":7},28,{"$f":"IF(R30<$Q$15+1,VLOOKUP(R30,Données!G32:H48,2),0)","v":0},{"$f":"5","v":5},0]
[{"$nulls":8},"Réponses données :",{"$f":"Q6","v":0},{"$nulls":7},29,{"$f":"IF(R31<$Q$15+1,VLOOKUP(R31,Données!G33:H49,2),0)","v":0},{"$f":"5","v":5},0]
[{"$nulls":9},"new  ",{"$nulls":7},30,{"$f":"IF(R32<$Q$15+1,VLOOKUP(R32,Données!G34:H50,2),0)","v":0},{"$f":"5","v":5},0]
[{"$nulls":17},31,{"$f":"IF(R33<$Q$15+1,VLOOKUP(R33,Données!G35:H51,2),0)","v":0},{"$f":"5","v":5},0]
[null,"Choix des portraits",{"$nulls":15},32,{"$f":"IF(R34<$Q$15+1,VLOOKUP(R34,Données!G36:H52,2),0)","v":0},{"$f":"5","v":5},0]
[null,{"$f":"C35-1","v":8},9,{"$nulls":14},33,{"$f":"IF(R35<$Q$15+1,VLOOKUP(R35,Données!G37:H53,2),0)","v":0},{"$f":"5","v":5},0]
[null,"Zoom",{"$nulls":15},34,{"$f":"IF(R36<$Q$15+1,VLOOKUP(R36,Données!G38:H54,2),0)","v":0},{"$f":"5","v":5},0]
[{"$nulls":17},35,{"$f":"IF(R37<$Q$15+1,VLOOKUP(R37,Données!G39:H55,2),0)","v":0},{"$f":"5","v":5},0]
[{"$nulls":7},"© Yvan Péguiron - infodidac.ch - rév. 12.03.11 compatible Excel Mac 2011",{"$nulls":9},36,{"$f":"IF(R38<$Q$15+1,VLOOKUP(R38,Données!G40:H56,2),0)","v":0},{"$f":"5","v":5},0]
[{"$nulls":17},37,{"$f":"IF(R39<$Q$15+1,VLOOKUP(R39,Données!G41:H57,2),0)","v":0},{"$f":"5","v":5},0]
[{"$nulls":17},38,{"$f":"IF(R40<$Q$15+1,VLOOKUP(R40,Données!G42:H58,2),0)","v":0},{"$f":"5","v":5},0]
{"$rows_left_out":23}
{"sheet":"Consignes","index":1,"n_rows":39,"n_cols":14,"rows_kept":39,"merged":[[1,1,2,1],[1,2,2,2],[1,3,2,3],[1,4,2,4],[1,5,2,5],[1,6,2,6],[1,7,2,7],[1,8,2,8],[1,9,2,9],[1,10,2,10],[1,11,2,11],[4,2,5,11],[6,2,7,11],[8,2,9,11],[11,3,14,10]]}
[]
[null,"S","U","P","E","R",null,"Q","U","I","Z"]
[]
[]
[null,null,"Le maître pose une question..."]
[]
[null,null,"...et quatre camarades te proposent des solutions."]
[]
[null,null,"      Un seul dit la vérité, à toi de trouver lequel !"]
[]
[]
[{"$nulls":3},"Clique sur le visage du maître pour obtenir une question, puis sur le visage du copain ou de la copine qui ne ment pas !"]
[]
[]
[]
[]
[]
[{"$nulls":4},"Tu peux changer ici le prénom des quatre camarades"]
[{"$nulls":3},"Choix ",1,2,3,4,5,6,7,8,9,10]
[null,null,1,{"$f":"HLOOKUP('  Q U I Z  '!$C$35,$E$19:$N$23,2)","v":"Madona"},"Annie","Dinh Lam","Alizée","Angelina","Abigaïl","Arava","Kant","Touria","Madona","Amaris"]
[null,null,2,{"$f":"HLOOKUP('  Q U I Z  '!$C$35,$E$19:$N$23,3)","v":"Vanessa"},"Béa","Samîra","Brenda","Brooklyn","Bélinda","Bin-Ying","Rousseau","Arouna","Vanessa","Basile"]
[null,null,3,{"$f":"HLOOKUP('  Q U I Z  '!$C$35,$E$19:$N$23,4)","v":"George"},"Chris","Marie","Charlène","Chloé","Cédric","Chama","Spinoza","Katsouko","George","Camellia"]
[null,null,4,{"$f":"HLOOKUP('  Q U I Z  '!$C$35,$E$19:$N$23,5)","v":"Britney"},"Dan","Jacob","Donan","Diana","Dennys","Diatou","Descartes","Sébastien","Britney","Dahlia"]
[]
[null,"Règle du jeu pour un joueur :"]
[null,"Si la case en bas à gauche est cochée, le joueur n'a droit qu'à une seule réponse par question."]
[null,"Dans ce cas, le score indique le nombre de bonnes réponses du premier coup."]
[null,"Dans le cas contraire, il faudra analyser le rapport entre les questions posées et les réponses données."]
[]
[null,"Règle du jeu pour deux joueurs :"]
[null,"On tire au sort celui qui commence."]
[null,"Le premier joueur tire sa question et tente d'y répondre. S'il répond juste du premier coup il obtient"]
[null,"1 point, sinon zéro point; dans les deux cas il passe la main au deuxième joueur."]
[null,"Le deuxième joueur s'il peut répondre à la question du premier gagne 2 points puis tire sa question."]
[null,"Dans le cas où il se trompe également  alors il perd tout et passe la main en sautant son tour."]
[]
[]
[null,"Pour commencer une nouvelle partie, il faut cliquer sur le petit"]
[null,"carré gris du coin inférieur droite."]

{"sheet":"Version papier","index":2,"n_rows":217,"n_cols":5,"rows_kept":217,"merged":[[0,0,0,6],[2,1,3,1],[7,1,8,1],[12,1,13,1],[17,1,18,1],[22,1,23,1],[27,1,28,1],[32,2,32,3],[33,1,34,1],[38,1,39,1],[43,1,44,1],[48,1,49,1],[53,1,54,1],[58,1,59,1],[63,2,63,3],[64,1,65,1],[69,1,70,1],[74,1,75,1],[79,1,80,1],[84,1,85,1],[89,1,90,1],[94,2,94,3],[95,1,96,1],[100,1,101,1],[105,1,106,1],[110,1,111,1],[115,1,116,1],[120,1,121,1],[125,2,125,3],[126,1,127,1],[131,1,132,1],[136,1,137,1],[141,1,142,1],[146,1,147,1],[151,1,152,1],[156,2,156,3],[157,1,158,1],[162,1,163,1],[167,1,168,1],[172,1,173,1],[177,1,178,1],[182,1,183,1],[187,2,187,3],[188,1,189,1],[193,1,194,1],[198,1,199,1],[203,1,204,1],[208,1,209,1],[213,1,214,1]]}
["QCM sur le code pénal"]
[]
[{"$f":"Données!A5","v":1},{"$f":"Données!B5","v":"De quelle infraction s'agit-il si je dis: \"mon professeur d'histoire est un imbécile\""},null,"A",{"$f":"Données!C5","v":"injure"}]
[{"$nulls":3},"B",{"$f":"Données!D5","v":"calomnie"}]
[{"$nulls":3},"C",{"$f":"Données!E5","v":"diffamation"}]
[{"$nulls":3},"D",{"$f":"Données!F5","v":"menace"}]
[]
[{"$f":"Données!A6","v":2},{"$f":"Données!B6","v":"Qu'est-ce qu'une atteinte à la liberté? "},null,"A",{"$f":"Données!C6","v":"Ce sont des affirmations qui sous-entendent un fait méprisable à propos d'une personne. "}]
[{"$nulls":3},"B",{"$f":"Données!D6","v":"C'est le fait de tuer une personne"}]
[{"$nulls":3},"C",{"$f":"Données!E6","v":"C'est obliger une personne à faire ou à subir quelque chose"}]
[{"$nulls":3},"D",{"$f":"Données!F6","v":"C'est le fait  d'endommager, de détruire ou de mettre hors d'usage une chose appartenant à autrui. "}]
[]
[{"$f":"Données!A7","v":3},{"$f":"Données!B7","v":"De quelle infraction s'agit-il si une personne me prête de l'argent et me demande un taux d'intérêt de 20% "},null,"A",{"$f":"Données!C7","v":"L'abus de confiance"}]
[{"$nulls":3},"B",{"$f":"Données!D7","v":"Le chantage"}]
[{"$nulls":3},"C",{"$f":"Données!E7","v":"Le vol"}]
[{"$nulls":3},"D",{"$f":"Données!F7","v":"L'usure"}]
[]
[{"$f":"Données!A8","v":4},{"$f":"Données!B8","v":"Lorsque je braque intentionnellement un magasin, quelle est mon implication dans cette infraction?"},null,"A",{"$f":"Données!C8","v":"Je suis coauteur"}]
[{"$nulls":3},"B",{"$f":"Données!D8","v":"Je suis l'instigateur"}]
[{"$nulls":3},"C",{"$f":"Données!E8","v":"Je suis l'auteur"}]
[{"$nulls":3},"D",{"$f":"Données!F8","v":"reste de sa vie de liberté"}]
[]
[{"$f":"Données!A9","v":5},{"$f":"Données!B9","v":"Quelle est l'atteinte si l'on séquestre quelqu'un?"},null,"A",{"$f":"Données!C9","v":"Atteinte à la vie"}]
[{"$nulls":3},"B",{"$f":"Données!D9","v":"Atteinte l'intégrité corporelle"}]
[{"$nulls":3},"C",{"$f":"Données!E9","v":"Atteinte à l'honneur"}]
[{"$nulls":3},"D",{"$f":"Données!F9","v":"Atteinte à la liberté"}]
[]
[{"$f":"Données!A10","v":6},{"$f":"Données!B10","v":"En combien de livres est divisé le code pénal ?"},null,"A",{"$f":"Données!C10","v":"2 livres"}]
[{"$nulls":3},"B",{"$f":"Données!D10","v":"3 livres"}]
[{"$nulls":3},"C",{"$f":"Données!E10","v":"4 livres "}]
[{"$nulls":3},"D",{"$f":"Données!F10","v":"5 livres"}]
[]
[null,null,"page 2"]
[{"$f":"Données!A11","v":7},{"$f":"Données!B11","v":"Deux amis décident de dérober un objet précieux chez une tierce personne. Malheureusement pour eux, la maison était occupée et ils ont du rentrer chez eux. Il s'agissait: "},null,"A",{"$f":"Données!C11","v":"d'une tentative"}]
[{"$nulls":3},"B",{"$f":"Données!D11","v":"d'un délit manqué"}]
[{"$nulls":3},"C",{"$f":"Données!E11","v":"d'un délit impossible"}]
[{"$nulls":3},"D",{"$f":"Données!F11","v":"d'un acte préparatoire"}]
[]
[{"$f":"Données!A12","v":8},{"$f":"Données!B12","v":"Si vous attaquez Mr X au couteau (il y a quelques blessures sans atteinte permanente à la santé), il s'agit : "},null,"A",{"$f":"Données!C12","v":"D'un assassinat"}]
[{"$nulls":3},"B",{"$f":"Données!D12","v":"De lésions corporelles graves"}]
{"$rows_left_out":178}
{"sheet":"Données","index":3,"n_rows":45,"n_cols":15,"rows_kept":45,"hidden":true,"merged":[[1,2,1,5],[1,8,1,11]]}
[1,2,3,4,5,6,1,2,3,4,5,6]
["Total","Question","propositions",{"$nulls":4},"Rép.","Commentaires",{"$nulls":4},"Si qu'une réponse :",{"$f":"IF('  Q U I Z  '!Q18=TRUE,\"Non, désolé\",\"Cherche encore !\")","v":"Cherche encore !"}]
[{"$f":"COUNTA(B5:B45)","v":20},null,1,2,3,4,null,"juste",1,2,3,4]
[0,"Cliquer sur ma tête pour obtenir une question sur le Code pénal",{"$f":"\"Salut, mon nom est \" & Consignes!D20","v":"Salut, mon nom est Madona"},{"$f":"\" Moi, je m'appelle \" & Consignes!D21","v":" Moi, je m'appelle Vanessa"},{"$f":"\"... et moi \" &Consignes!D22","v":"... et moi George"},{"$f":"\"Hello, je suis \" & Consignes!D23","v":"Hello, je suis Britney"},0]
[1,"De quelle infraction s'agit-il si je dis: \"mon professeur d'histoire est un imbécile\"","injure","calomnie","diffamation","menace",1,1,"BRAVO","lorsqu'on communique à un tiers des affirmations sur quelqu'un  alors qu'on sait qu'elles sont fausses","lorsqu'on communique à un tiers une affirmation qui porte atteinte à l'honneur de quelqu'un","le fait d'alarmer ou d'effrayer une personne en lui suggérant que quelque chose de grave va lui arriver."]
[2,"Qu'est-ce qu'une atteinte à la liberté? ","Ce sont des affirmations qui sous-entendent un fait méprisable à propos d'une personne. ","C'est le fait de tuer une personne","C'est obliger une personne à faire ou à subir quelque chose","C'est le fait  d'endommager, de détruire ou de mettre hors d'usage une chose appartenant à autrui. ",2,3,"NON, c'est une atteinte à l'honneur","NON, c'est une atteinte à la vie","BRAVO","NON, c'est une infraction contre le partimoine"]
[3,"De quelle infraction s'agit-il si une personne me prête de l'argent et me demande un taux d'intérêt de 20% ","L'abus de confiance","Le chantage","Le vol","L'usure",3,4,"NON, c'est lorsqu'une personne s'approprie définitivement un bien qui ne lui a été que confié","NON, pour qu'il y ait chantage, il faut menacer de faire du tort à une personne, en révélant un fait si celle-ci ne lui verse pas d'argent. ","NON, le vol consiste à soustraire un bien appartenant à autrui dans un but d'enrichissement. ","BRAVO"]
[4,"Lorsque je braque intentionnellement un magasin, quelle est mon implication dans cette infraction?","Je suis coauteur","Je suis l'instigateur","Je suis l'auteur","reste de sa vie de liberté",4,3,"NON, j'étais seul à le commettre","NON, je n'ai forcé personne à commettre l'infraction à ma place","BRAVO","NON, j'ai eu une emprise complète pour commettre le délit"]
[5,"Quelle est l'atteinte si l'on séquestre quelqu'un?","Atteinte à la vie","Atteinte l'intégrité corporelle","Atteinte à l'honneur","Atteinte à la liberté",5,4,"NON, on ne tue pas une personne","NON, essayez encore","NON, il n'y a pas d'affirmations qui sous-entendent un fait méprisable à propos d'une personne","BRAVO"]
[6,"En combien de livres est divisé le code pénal ?","2 livres","3 livres","4 livres ","5 livres",6,2,"NON, vous en oubliez","BRAVO","NON, essayez encore","NON, essayez encore"]
[7,"Deux amis décident de dérober un objet précieux chez une tierce personne. Malheureusement pour eux, la maison était occupée et ils ont du rentrer chez eux. Il s'agissait: ","d'une tentative","d'un délit manqué","d'un délit impossible","d'un acte préparatoire",7,4,"NON, ils n'ont pas été arrêtés pendant l'infraction car ils ne l'ont pas commise","NON, ils n'ont pas commis l'infraction","NON, l'infraction était possible","BRAVO, ils n'ont pas commis l'infraction puisqu'ils ont rebroussé chemin"]
[8,"Si vous attaquez Mr X au couteau (il y a quelques blessures sans atteinte permanente à la santé), il s'agit : ","D'un assassinat","De lésions corporelles graves","De lésions corporelles simples","De voies de fait",8,3,"NON, vous n'avez pas tué la personne","NON, pour qu'il y ait lésions corporelles graves il faut une atteinte permanente à la santé","BRAVO","NON car il y a une atteinte à la santé"]
[9,"Un homme suisse a commis une infraction en 2001 en Suisse et est jugé en 2004. Une nouvelle loi est entrée en vigueur en 2003. Quel principe va nous aider à savoir quelle loi appliquer? ","Le doute profite à l'accusé","Le principe de la légalité","Le principe de la non-rétroactivité","Le principe de la territorialité",9,3,"NON, essayez encore","NON, essayez encore","BRAVO, on appliquera la loi en vigueur lors de l'infraction commise et non la loi entrée en vigueur après sauf si elle est moins sévère.","NON essayer encore"]
[10,"Quelle est la liste des atteintes à la liberté? ","La contrainte, la menace, la prise d'otage. ","La contrainte, la menace, les voies de fait","La contrainte, la menace, l'assassinat. ","La contrainte, la menace, la diffamation. ",10,1,"BRAVO","NON, les voies de fait sont des atteintes à l'intégrité corporelle","NON, l'assassinat est une atteinte à la vie","NON, la diffamation est une atteinte à l'honneur"]
[11,"Qu'est-ce qu'un instigateur? ","Une personne qui pousse une autre à commettre une infraction, sans agir elle-même","Une personne qui a collaboré à la réalisation d'une infraction","Une personne qui a préparé une infraction et l'a menée à bien","Une personne qui participe à une infraction, sans avoir d'emprise sur les évènements",11,1,"BRAVO","NON, c'est un coauteur","NON, c'est un auteur","NON, c'est un complice. "]
[12,"Dans la liste trouvez un exemple de peine privative de liberté.","Les jours-amendes","L'emprisonnement","Le travail d'intérêt général","Une amende",12,2,"NON, c'est une peine pécuniaire","BRAVO","NON, cette peine consiste à fournir un travail  qui requiert l'accord du condamné","NON, c'est une peine pécuniaire"]
[13,"A partir de quel âge un mineur a une responsabilité restreinte de ses actes","14 ans","16 ans ","un mineur n'a aucune responsabilité avant ses 18 ans","10 ans",13,4,"NON, essayez encore","NON, essayez encore","NON, essayez encore","BRAVO"]
[14,"Si j'aide une personne à dissimules une machine à café volée et que j'en suis conscient, je peux être accusé de: ","Recel","Vol","Extorsion","Brigandage",14,1,"BRAVO","NON, je n'ai pas soustrait ce bien","NON, je n'ai pas soustrait ce bien et je n'ai donc pas exercé une pression sur la personne pour lui soustraire ce bien","NON, puisque je n'ai pas soustrait ce bien, je n'ai pas exercé de contrainte sur la personne pour lui soustraire ce bien. "]
[15,"Quelles sont les atteintes corporelles les plus graves? ","Les voies de fait","Les lésions corporelles graves","Les lésions corporelles simples","L'assassinat",15,2,"NON, les voies de fait sont des infractions sans atteintes à la santé","BRAVO","NON, il en existe des plus graves","NON, c'est une atteinte à la vie, pas une atteinte corporelle"]
[16,"La peine privative de liberté à perpétuité prive l'individu de ","20 ans de sa vie en liberté","10 ans de sa vie de liberté","30 ans de sa vie de liberté","reste de sa vie de liberté",16,1,"BRAVO","NON, essayez encore","NON, essayez encore","NON, essayez encore"]
[17,"Parmi la liste, citez la circonstance qui peut atténuer la peine encourue pour un assassinat: ","La victime avait un enfant","l'accusé a agi  dans une situation de détresse","l'accusé était fatigué","L'assassinat était accompagné de tortures",17,2,"NON, essayez encore","BRAVO","NON, ce n'est pas une circonstance valable","NON, c'est une circonstance aggravante"]
[18,"Quelle est la liste qui ne contient que des infractions contre le patrimoine? ","L'abus de confiance, le recel et le brigandage","Le chantage, l'extorsion et l'usure","L'escroquerie, le vol et la gestion déloyale","L'abus de confiance, la contrainte et l'usure",18,4,"NON, essayez encore","NON, essayez encore","NON, essayez encore","BRAVO, la contrainte est une atteinte à la liberté"]
[19,"Si une personne veut tuer le président X pendant une de ses conférences, qu'il le manque mais que la balle arrive dans l'écran de projection….il s'agit ","... d'un acte préparatoire","… d'une tentative","… d'un délit manqué","… d'un délit impossible",19,3,"NON, car il ne l'a pas que préparé. ","NON, car il a tiré avec son arme, personne ne l'a arrêté pendant l'action","BRAVO, il a tiré mais il n'a pas réussi à le tuer","NON, car l'infraction a pu être réalisée"]
[20,"En cas de non paiement de l'amende, le juge peut la substituer en peine privative de liberté ou: ","à l'internement à vie","à 6 mois de retrait de permis","en un avertissement ","en une peine de travail d'intérêt de général",20,4,"NON, essayez encore","NON, essayez encore","NON, essayez encore","BRAVO"]
[21,{"$nulls":5},21,null,{"$f":"IF(I$3=$H25,\"Bravo !\",$O$2)","v":"Cherche encore !"},"Cherche encore !","Cherche encore !","Cherche encore !"]
[22,{"$nulls":5},22,null,"Cherche encore !","Cherche encore !","Cherche encore !","Cherche encore !"]
[23,{"$nulls":5},23,null,"Cherche encore !","Cherche encore !","Cherche encore !","Cherche encore !"]
[24,{"$nulls":5},24,null,"Cherche encore !","Cherche encore !","Cherche encore !","Cherche encore !"]
[25,{"$nulls":5},25,null,"Cherche encore !","Cherche encore !","Cherche encore !","Cherche encore !"]
[26,{"$nulls":5},26,null,"Cherche encore !","Cherche encore !","Cherche encore !","Cherche encore !"]
[27,{"$nulls":5},27,null,"Cherche encore !","Cherche encore !","Cherche encore !","Cherche encore !"]
[28,{"$nulls":5},28,null,"Cherche encore !","Cherche encore !","Cherche encore !","Cherche encore !"]
[29,{"$nulls":5},29,null,"Cherche encore !","Cherche encore !","Cherche encore !","Cherche encore !"]
[30,{"$nulls":5},30,null,"Cherche encore !","Cherche encore !","Cherche encore !","Cherche encore !"]
[31,{"$nulls":5},31,null,"Cherche encore !","Cherche encore !","Cherche encore !","Cherche encore !"]
[32,{"$nulls":5},32,null,"Cherche encore !","Cherche encore !","Cherche encore !","Cherche encore !"]
[33,{"$nulls":5},33,null,"Cherche encore !","Cherche encore !","Cherche encore !","Cherche encore !"]
[34,{"$nulls":5},34,null,"Cherche encore !","Cherche encore !","Cherche encore !","Cherche encore !"]
[35,{"$nulls":5},35,null,"Cherche encore !","Cherche encore !","Cherche encore !","Cherche encore !"]
[36,{"$nulls":5},36,null,"Cherche encore !","Cherche encore !","Cherche encore !","Cherche encore !"]
{"$rows_left_out":6}
{"sheet":"Galerie","index":4,"n_rows":17,"n_cols":40,"rows_kept":17,"hidden":true}
[{"$nulls":26},"Kids","Religions","Ecoliers","Styles","Jeunes","Monde","Philosophes","Races","Stars","Clip"]
[{"$nulls":14},"Prof",{"$nulls":24},1]
[{"$nulls":14},"Choix 1"]
[{"$nulls":14},"Choix 2"]
[{"$nulls":14},"Choix 3"]
[{"$nulls":14},"Choix 4"]
[{"$nulls":26},"Menu"]
[{"$nulls":26},{"$f":"AA1","v":"Kids"}]
[{"$nulls":26},{"$f":"AB1","v":"Religions"}]
[{"$nulls":26},{"$f":"AC1","v":"Ecoliers"}]
[{"$nulls":26},{"$f":"AD1","v":"Styles"}]
[{"$nulls":26},{"$f":"AE1","v":"Jeunes"}]
[{"$nulls":26},{"$f":"AF1","v":"Monde"}]
[{"$nulls":26},{"$f":"AG1","v":"Philosophes"}]
[{"$nulls":26},{"$f":"AH1","v":"Races"}]
[{"$nulls":26},"Stars"]
[{"$nulls":26},"Clip"]