{"text_format":"3","workbook":"xlsx","n_sheets":5,"sheets":["  Q U I Z  ","Consignes","Version papier","Données","Galerie"],"not_rendered":{"images":60,"macros":1,"external_links":2,"defined_names":10},"read":"whole","date_system":"1900"}

{"sheet":"  Q U I Z  ","index":0,"n_rows":62,"n_cols":21,"rows_kept":62,"merged":[[1,8,7,9],[2,1,3,1],[2,3,4,7],[2,10,3,10],[5,1,6,1],[5,10,6,10],[6,4,7,7],[7,2,11,3],[8,1,9,1],[8,8,8,9],[8,10,9,10],[10,5,11,8],[11,1,12,1],[11,10,12,10],[12,3,15,3],[14,1,15,1],[14,10,15,10],[15,5,16,8],[16,2,19,3],[18,1,19,1],[18,10,19,10],[19,5,20,8],[20,3,23,4],[21,1,22,1],[21,10,22,10],[24,1,25,1],[24,2,24,3],[24,10,25,10],[25,5,27,7],[26,3,27,3],[27,1,29,1],[27,10,29,10]]}
[{"$nulls":17},0,{"$f":"IF(R1<$Q$15+1,VLOOKUP(R1,Données!G4:H20,2),0)","v":0},{"$f":"5","v":5}]
[{"$nulls":16},"Comp. questions",1,{"$f":"IF(R2<$Q$15+1,VLOOKUP(R2,Données!G5:H21,2),0)","v":1},{"$f":"5","v":5},{"$f":"IF(T2=S2,1,0)","v":0}]
[null,"S",null,{"$f":"VLOOKUP(C5,Données!A4:F60,2)","v":"Cliquer sur ma tête pour obtenir une question d'introduction au droit"},{"$nulls":6},"S",{"$nulls":5},0,2,{"$f":"IF(R3<$Q$15+1,VLOOKUP(R3,Données!G6:H22,2),0)","v":4},{"$f":"5","v":5},{"$f":"IF(T3=S3,1,0)","v":0}]
[{"$nulls":17},3,{"$f":"IF(R4<$Q$15+1,VLOOKUP(R4,Données!G7:H23,2),0)","v":3},{"$f":"5","v":5},0]
[null,null,0,{"$nulls":13},"Comp. réponses",4,{"$f":"IF(R5<$Q$15+1,VLOOKUP(R5,Données!G8:H24,2),0)","v":2},{"$f":"5","v":5},0]
[null,"U",{"$nulls":8},"U",{"$nulls":5},0,5,{"$f":"IF(R6<$Q$15+1,VLOOKUP(R6,Données!G9:H25,2),0)","v":1},{"$f":"5","v":5},0]
[{"$nulls":4},{"$f":"VLOOKUP($C$5,Données!$A$4:$F$60,3)","v":"Salut, mon nom est Annie"},{"$nulls":12},6,{"$f":"IF(R7<$Q$15+1,VLOOKUP(R7,Données!G10:H26,2),0)","v":3},{"$f":"5","v":5},0]
[{"$nulls":16},"Réponse choisie",7,{"$f":"IF(R8<$Q$15+1,VLOOKUP(R8,Données!G11:H27,2),0)","v":4},{"$f":"5","v":5},0]
[null,"P",{"$nulls":6},"           Cliquez sur les visages !     ",null,"P",{"$nulls":5},0,8,{"$f":"IF(R9<$Q$15+1,VLOOKUP(R9,Données!G12:H28,2),0)","v":4},{"$f":"5","v":5},0]
[{"$nulls":17},9,{"$f":"IF(R10<$Q$15+1,VLOOKUP(R10,Données!G13:H29,2),0)","v":1},{"$f":"5","v":5},0]
[{"$nulls":5},{"$f":"VLOOKUP($C$5,Données!$A$4:$F$60,4)","v":" Moi, je m'appelle Béa"},{"$nulls":10},"Nb rép. justes",10,{"$f":"IF(R11<$Q$15+1,VLOOKUP(R11,Données!G14:H30,2),0)","v":2},{"$f":"5","v":5},0]
[null,"E",{"$nulls":8},"E",{"$nulls":5},{"$f":"SUM(U1:U62)","v":0},11,{"$f":"IF(R12<$Q$15+1,VLOOKUP(R12,Données!G15:H31,2),0)","v":3},{"$f":"5","v":5},0]
[{"$nulls":17},12,{"$f":"IF(R13<$Q$15+1,VLOOKUP(R13,Données!G16:H32,2),0)","v":4},{"$f":"5","v":5},0]
[{"$nulls":16},"Nb de questions",13,{"$f":"IF(R14<$Q$15+1,VLOOKUP(R14,Données!G17:H33,2),0)","v":3},{"$f":"5","v":5},0]
[null,"R",{"$nulls":8},"R",{"$nulls":5},{"$f":"Données!A3","v":25},14,{"$f":"IF(R15<$Q$15+1,VLOOKUP(R15,Données!G18:H34,2),0)","v":2},{"$f":"5","v":5},0]
[{"$nulls":5},{"$f":"VLOOKUP($C$5,Données!$A$4:$F$60,5)","v":"... et moi Chris"},{"$nulls":11},15,{"$f":"IF(R16<$Q$15+1,VLOOKUP(R16,Données!G19:H35,2),0)","v":1},{"$f":"5","v":5},0]
[{"$nulls":16},"Q'une réponse",16,{"$f":"IF(R17<$Q$15+1,VLOOKUP(R17,Données!G20:H36,2),0)","v":4},{"$f":"5","v":5},0]
[{"$nulls":16},false,17,{"$f":"IF(R18<$Q$15+1,VLOOKUP(R18,Données!G21:H37,2),0)","v":3},{"$f":"5","v":5},0]
[null,"Q",{"$nulls":8},"Q",{"$nulls":5},{"$f":"IF(Q18=TRUE,1,0)","v":0},18,{"$f":"IF(R19<$Q$15+1,VLOOKUP(R19,Données!G22:H38,2),0)","v":2},{"$f":"5","v":5},0]
[{"$nulls":5},{"$f":"VLOOKUP($C$5,Données!$A$4:$F$60,6)","v":"Hello, je suis Dan"},{"$nulls":11},19,{"$f":"IF(R20<$Q$15+1,VLOOKUP(R20,Données!G23:H39,2),0)","v":1},{"$f":"5","v":5},0]
{"$rows_left_out":43}
{"sheet":"Consignes","index":1,"n_rows":39,"n_cols":14,"rows_kept":39,"merged":[[1,1,2,1],[1,2,2,2],[1,3,2,3],[1,4,2,4],[1,5,2,5],[1,6,2,6],[1,7,2,7],[1,8,2,8],[1,9,2,9],[1,10,2,10],[1,11,2,11],[4,2,5,11],[6,2,7,11],[8,2,9,11],[11,3,14,10]]}
[]
[null,"S","U","P","E","R",null,"Q","U","I","Z"]
[]
[]
[null,null,"Le maître pose une question..."]
[]
[null,null,"...et quatre camarades te proposent des solutions."]
[]
[null,null,"      Un seul dit la vérité, à toi de trouver lequel !"]
[]
[]
[{"$nulls":3},"Clique sur le visage du maître pour obtenir une question, puis sur le visage du copain ou de la copine qui ne ment pas !"]
[]
[]
[]
[]
[]
[{"$nulls":4},"Tu peux changer ici le prénom des quatre camarades"]
[{"$nulls":3},"Choix ",1,2,3,4,5,6,7,8,9,10]
[null,null,1,{"$f":"HLOOKUP('  Q U I Z  '!$C$35,$E$19:$N$23,2)","v":"Annie"},"Annie","Dinh Lam","Alizée","Angelina","Abigaïl","Arava","Kant","Touria","Madona","Amaris"]
{"$rows_left_out":20}
{"sheet":"Version papier","index":2,"n_rows":217,"n_cols":5,"rows_kept":217,"merged":[[0,0,0,6],[2,1,3,1],[7,1,8,1],[12,1,13,1],[17,1,18,1],[22,1,23,1],[27,1,28,1],[32,2,32,3],[33,1,34,1],[38,1,39,1],[43,1,44,1],[48,1,49,1],[53,1,54,1],[58,1,59,1],[63,2,63,3],[64,1,65,1],[69,1,70,1],[74,1,75,1],[79,1,80,1],[84,1,85,1],[89,1,90,1],[94,2,94,3],[95,1,96,1],[100,1,101,1],[105,1,106,1],[110,1,111,1],[115,1,116,1],[120,1,121,1],[125,2,125,3],[126,1,127,1],[131,1,132,1],[136,1,137,1],[141,1,142,1],[146,1,147,1],[151,1,152,1],[156,2,156,3],[157,1,158,1],[162,1,163,1],[167,1,168,1],[172,1,173,1],[177,1,178,1],[182,1,183,1],[187,2,187,3],[188,1,189,1],[193,1,194,1],[198,1,199,1],[203,1,204,1],[208,1,209,1],[213,1,214,1]]}
["QCM sur l'introduction au droit"]
[]
[{"$f":"Données!A5","v":1},{"$f":"Données!B5","v":"Qu'est-ce que la jurisprudence ?"},null,"A",{"$f":"Données!C5","v":"C'est l'interprétation de la loi par les tribunaux."}]
[{"$nulls":3},"B",{"$f":"Données!D5","v":"C'est l'ensemble des règles non écrites communes à une société."}]
[{"$nulls":3},"C",{"$f":"Données!E5","v":"C'est l'ensemble des textes de loi votés par le parlement."}]
[{"$nulls":3},"D",{"$f":"Données!F5","v":"C'est une façon d'être prudent dans la vie."}]
[]
[{"$f":"Données!A6","v":2},{"$f":"Données!B6","v":"Quelle est l'étymologie du mot droit ?"},null,"A",{"$f":"Données!C6","v":"Cela vient du mot grec \"doctorios \" qui signifie doctrine !"}]
[{"$nulls":3},"B",{"$f":"Données!D6","v":"Cela vient du mot du mot \" dextra \" qui veut dire la main droite, la justesse !"}]
[{"$nulls":3},"C",{"$f":"Données!E6","v":"Cela vient du mot \"dominus \" qui signifie \" le maître \" !"}]
[{"$nulls":3},"D",{"$f":"Données!F6","v":"Cela vient du mot latin \" direction \" qui est lié à la notion d'autorité !"}]
[]
[{"$f":"Données!A7","v":3},{"$f":"Données!B7","v":"Quelle est la source la plus ancienne du droit ?"},null,"A",{"$f":"Données!C7","v":"C'est le bâton ! Le droit du plus fort !"}]
[{"$nulls":3},"B",{"$f":"Données!D7","v":"C'est la doctrine !"}]
[{"$nulls":3},"C",{"$f":"Données!E7","v":"C'est la coutume !"}]
[{"$nulls":3},"D",{"$f":"Données!F7","v":"C'est la jurisprudence !"}]
[]
[{"$f":"Données!A8","v":4},{"$f":"Données!B8","v":"Est-ce le droit Fédéral qui prime sur le droit cantonal, ou l'inverse ?"},null,"A",{"$f":"Données!C8","v":"Ils sont à égalité !"}]
[{"$nulls":3},"B",{"$f":"Données!D8","v":"C'est le droit fédéral qui prime sur le droit cantonal !"}]
[{"$nulls":3},"C",{"$f":"Données!E8","v":"C'est le droit cantonal qui prime sur tout !"}]
{"$rows_left_out":198}
{"sheet":"Données","index":3,"n_rows":45,"n_cols":15,"rows_kept":45,"hidden":true,"merged":[[1,2,1,5],[1,8,1,11]]}
[1,2,3,4,5,6,1,2,3,4,5,6]
["Total","Question","propositions",{"$nulls":4},"Rép.","Commentaires",{"$nulls":4},"Si qu'une réponse :",{"$f":"IF('  Q U I Z  '!Q18=TRUE,\"Non, désolé\",\"Cherche encore !\")","v":"Cherche encore !"}]
[{"$f":"COUNTA(B5:B45)","v":25},null,1,2,3,4,null,"juste",1,2,3,4]
[0,"Cliquer sur ma tête pour obtenir une question d'introduction au droit",{"$f":"\"Salut, mon nom est \" & Consignes!D20","v":"Salut, mon nom est Annie"},{"$f":"\" Moi, je m'appelle \" & Consignes!D21","v":" Moi, je m'appelle Béa"},{"$f":"\"... et moi \" & Consignes!D22","v":"... et moi Chris"},{"$f":"\"Hello, je suis \" & Consignes!D23","v":"Hello, je suis Dan"},0]
[1,"Qu'est-ce que la jurisprudence ?","C'est l'interprétation de la loi par les tribunaux.","C'est l'ensemble des règles non écrites communes à une société.","C'est l'ensemble des textes de loi votés par le parlement.","C'est une façon d'être prudent dans la vie.",1,1,"La jurisprudence est l'ensemble des décisions rendues par les tribunaux sur la base des cas concrets qui leur sont soumis. ","Désolé ! Mais jurisprudence, cela ressemble un peu à juriste, non ? ","Oups ! Courage cherche encore !","Mon petit doigt me dit que cela doit avoir un rapport avec le judiciaire…"]
[2,"Quelle est l'étymologie du mot droit ?","Cela vient du mot grec \"doctorios \" qui signifie doctrine !","Cela vient du mot du mot \" dextra \" qui veut dire la main droite, la justesse !","Cela vient du mot \"dominus \" qui signifie \" le maître \" !","Cela vient du mot latin \" direction \" qui est lié à la notion d'autorité !",2,4,"Désolé ! Cherche encore…","Peut-être qu'il faut regarder du côté du latin ?","Le maître est le garant de l'autorité ! Tu brûles…","\"directum\", dérivé de dirigere (diriger) et \"jus\" dérivé de \"jussus\", \"jubere\", ordonner. On met ici l'accent sur l'autorité et l'aspect social du droit."]
[3,"Quelle est la source la plus ancienne du droit ?","C'est le bâton ! Le droit du plus fort !","C'est la doctrine !","C'est la coutume !","C'est la jurisprudence !",3,3,"La loi du plus fort a effectivement été à l'origine du droit pour protéger le plus faible…","Désolé ! La doctrine influence le futur de la loi…","La coutume était la loi orale bien avant qu'elle ne soit écrite…","Désolé, cherche encore !"]
[4,"Est-ce le droit Fédéral qui prime sur le droit cantonal, ou l'inverse ?","Ils sont à égalité !","C'est le droit fédéral qui prime sur le droit cantonal !","C'est le droit cantonal qui prime sur tout !","Ni l'un ni l'autre ne vient avant !",4,2,"Le droit est hiérarchique, il ne peut y avoir d'égalité…","Bravo ! Effectivement, le droit cantonal déroge au droit fédéral…","Désolé ! Il ne te reste que l'autre réponse…","Courage, il ne te reste que l'autre possibilité !"]
[5,"À quoi sert la doctrine ?","Faciliter la compréhension des règles et des problèmes juridique. ","Permettre à un Koala venant de Nouvelle-Zélande d'apprendre l'Histoire Suisse…","À enseigner la manière de contourner la loi !","À avoir l'air sérieux lorsqu'on parle de la loi…",5,1,"Oui ! La doctrine est les publications sur le droit qui orientent le futur de la loi et l'adapte à la société…","Seulement pour les Koalas qui savent lire !","Il est vrai que pour contourner la loi, il faut déjà la comprendre !","Le sérieux ne fait pas forcément le juriste !"]
[6,"Qu'est-ce qui distingue la coutume de la tradition ?","La coutume est à l'origine de la tradition, elles sont orales…","La coutume est une source récente du droit !","La tradition est à l'origine de la coutume qui est source du droit.","La tradition s'adresse aux vieux et la coutume à tout le monde…",6,3,"La tradition inspire la coutume. La bible ou le Coran sont des traditions, mais elles sont pourtant écrites…","Désolé, cherche encore !","La coutume est liée à la tradition qui l'inspire. La coutume est l'application de la tradition…","Ce n’est pas vraiment évident n'est-ce pas ?"]
[7,"Qu'est-ce qui différencie la coutume de la jurisprudence ?","La coutume crée la jurisprudence…","Les deux sont orales !","La coutume est plus ancienne !","la jurisprudence est une coutume écrite du droit moderne…",7,4,"C'était vrai au Moyen-Âge, mais plus aujourd'hui !","Il existe des coutumes écrites !","Pas forcément, au Moyen-Âge, le coutumier, au sens d’assesseur de justice, transmettait et récitait la coutume dans les tribunaux.","Oui, la jurisprudence est une source de droit vivante, car elle évolue, se modifie alors que la coutume est un usage souvent ancien voire très ancien qui peut se perdre."]
[8,"Durant combien de temps une œuvre est protégée après le décès de son auteur ?","2 ans !","4 ans !","30 ans !","70 ans !",8,4,"Le droit d'auteur est protégé…","Le droit de la propriété intellectuelle vise la protection des biens immatériels.","Télécharger illégalement une œuvre musicale sur le web, c'est du vol !","50 ans pour les logiciels !"]
[9,"À quoi sert le droit pénal ?","Il définit les infractions et leurs répressions…","Il organise les services publics !","Il règle l'organisation de l'Etat…","Il gère la manière de conduire un procès devant les tribunaux.",9,1,"Il réprime les actes qui mettent en danger la sécurité et l'intégrité des personnes ou des biens. Il garantit l'ordre public.","Cherche encore ! Pénal cela vient de quoi ?","Du latin : \"poenas, pendere\" : expier…","Dans pénal, il y a peine…"]
[10,"Que détermine le droit de la famille ?","La répartition des biens en cas de décès…","Il détermine les fiançailles, les régimes matrimoniaux, le divorce, l'union libre et le partenariat.","Le droit d'aimer ou de détester ses parents.","Le droit qui gère les relations entre l'état et les familles.",10,2,"Non, ça c'est le droit des successions…","Le droit de la famille gère l'organisation et les relations des personnes qui vivent ensemble.","Le droit de la famille détermine les droits et les devoirs de chacun dans une famille.","L'Etat officialise les liens juridiques des personnes vivant ensemble."]
[11,"Que définit le droit du travail ?","Les infractions au travail !","Il détermine le droit au travail !","Il définit les relations contractuelles entre employeurs et employés !","Il définit les manières de travailler !",11,3,"Le travail est une forme de contrat !","Le droit au travail n'a rien à voir avec le droit du travail.","Le droit du travail régit la loi sur le travail, les conventions collectives, les contrats de travail.","Cela peut être le cas dans les conventions collectives."]
[12,"Qu'est-ce que le Droit ? À quoi sert-il ?","À justifier ce qu'on a envie de faire !","À rendre tous les humains libres !","À envoyer les bandits en prison !","C'est un ensemble de règles de conduite imposées à tous et qui permettent la vie en société.",12,4,"Pour autant qu'on en a le droit !","Le droit ne rend pas libre il protège le faible du fort. Il favorise l'équité.","Effectivement, pour ce qui est du droit pénal !","Le droit est applicable à l'ensemble de la population d'un pays et à ses autorités."]
[13,"Que faut-il pour qu'une initiative aboutisse ?","10'000 signatures en 18 mois !","20'000 signatures en 20 mois !","100'000 signatures en 18 mois !","20'000 signatures en 12 mois !",13,3,"L'initiative est le droit qu'ont les citoyens suisses de proposer une modification de la Constitution fédérale.","Si l'initiative aboutit, le Conseil fédéral est tenu de soumettre le texte à votation populaire.","L'initiative populaire comme le droit de référendum sont des droits constitutionnels.","La double majorité du peuple et des cantons est requise pour que l'initiative soit acceptée. "]
[14,"Quel est le fondement du droit dans les états modernes ?","Le contrôle de constitutionnalité !","La séparation des pouvoirs et l'état de droit !","Des principes moraux et religieux dans la constitution !","Avoir un Etat fort avec beaucoup de policier !",14,2,"La Suisse est un cas particulier où cette fonction n'existe pas, car la démocratie directe donne toujours le dernier mot au peuple.","La séparation des pouvoirs est le respect des règles qui gèrent les pouvoirs de l'Etat sont la garantie d'une organisation politique équitable et aboutie.","Si pendant longtemps la morale et la religion avaient force de loi, aujourd'hui cela est beaucoup plus relativisé.","Cela serait plutôt une dictature !"]
[15,"Quels sont les deux grands domaines du droit ?","Le droit public et le droit privé !","Le Code civil et le code des obligations","Le droit constitutionnel et les lois","La loi et la jurisprudence",15,1,"Le droit public régit l'organisation de l'Etat et ses rapports avec les personnes tendis que le droit privé régit les rapports juridiques entre les personnes physiques ou morales.","Ces codes font partie du droit privé…","La constitution est la loi-cadre, aucune loi ne peut la contredire.","La loi et la jurisprudence sont les sources principales du droit."]
[16,"Que régit le droit privé ?","La loi est la même pour tout le monde !","Les intérêts privés des personnes !","Le Code civil !","Les relations des personnes physiques ou morales entre elles !",16,4,"Même si certains ne s'estiment pas être comme tout le monde !","Il ne faut pas confondre intérêts privés et rapports juridiques","C'est une sous-catégorie du droit privé.","Il est fondé sur l'égalité de traitement entre les parties."]
{"$rows_left_out":26}
{"sheet":"Galerie","index":4,"n_rows":17,"n_cols":40,"rows_kept":17,"hidden":true}
[{"$nulls":26},"Kids","Religions","Ecoliers","Styles","Jeunes","Monde","Philosophes","Races","Stars","Clip"]
[{"$nulls":14},"Prof",{"$nulls":24},1]
[{"$nulls":14},"Choix 1"]
[{"$nulls":14},"Choix 2"]
[{"$nulls":14},"Choix 3"]
[{"$nulls":14},"Choix 4"]
[{"$nulls":26},"Menu"]
[{"$nulls":26},{"$f":"AA1","v":"Kids"}]
[{"$nulls":26},{"$f":"AB1","v":"Religions"}]
[{"$nulls":26},{"$f":"AC1","v":"Ecoliers"}]
[{"$nulls":26},{"$f":"AD1","v":"Styles"}]
[{"$nulls":26},{"$f":"AE1","v":"Jeunes"}]
[{"$nulls":26},{"$f":"AF1","v":"Monde"}]
[{"$nulls":26},{"$f":"AG1","v":"Philosophes"}]
[{"$nulls":26},{"$f":"AH1","v":"Races"}]
[{"$nulls":26},"Stars"]
[{"$nulls":26},"Clip"]