{"text_format":"3","workbook":"xlsx","n_sheets":5,"sheets":["  Q U I Z  ","Consignes","Données","Version papier","Galerie"],"not_rendered":{"images":60,"macros":1,"defined_names":5},"read":"whole","date_system":"1900"}

{"sheet":"  Q U I Z  ","index":0,"n_rows":62,"n_cols":21,"rows_kept":62,"merged":[[1,8,7,9],[2,1,3,1],[2,3,4,7],[2,10,3,10],[5,1,6,1],[5,10,6,10],[6,4,7,7],[7,2,11,3],[8,1,9,1],[8,8,8,9],[8,10,9,10],[10,5,11,8],[11,1,12,1],[11,10,12,10],[12,3,15,3],[14,1,15,1],[14,10,15,10],[15,5,16,8],[16,2,19,3],[18,1,19,1],[18,10,19,10],[19,5,20,8],[20,3,23,4],[21,1,22,1],[21,10,22,10],[24,1,25,1],[24,2,24,3],[24,10,25,10],[25,5,27,7],[26,3,27,3],[27,1,29,1],[27,10,29,10]]}
[{"$nulls":17},0,{"$f":"IF(R1<$Q$15+1,VLOOKUP(R1,Données!G4:H20,2),0)","v":0},{"$f":"5","v":5}]
[{"$nulls":16},"Comp. questions",1,{"$f":"IF(R2<$Q$15+1,VLOOKUP(R2,Données!G5:H21,2),0)","v":1},{"$f":"5","v":5},{"$f":"IF(T2=S2,1,0)","v":0}]
[null,"S",null,{"$f":"VLOOKUP(C5,Données!A4:F60,2)","v":"Cliquer sur ma tête pour obtenir une question d'économie"},{"$nulls":6},"S",{"$nulls":5},0,2,{"$f":"IF(R3<$Q$15+1,VLOOKUP(R3,Données!G6:H22,2),0)","v":3},{"$f":"5","v":5},{"$f":"IF(T3=S3,1,0)","v":0}]
[{"$nulls":17},3,{"$f":"IF(R4<$Q$15+1,VLOOKUP(R4,Données!G7:H23,2),0)","v":4},{"$f":"5","v":5},0]
[null,null,0,{"$nulls":13},"Comp. réponses",4,{"$f":"IF(R5<$Q$15+1,VLOOKUP(R5,Données!G8:H24,2),0)","v":1},{"$f":"5","v":5},0]
[null,"U",{"$nulls":8},"U",{"$nulls":5},0,5,{"$f":"IF(R6<$Q$15+1,VLOOKUP(R6,Données!G9:H25,2),0)","v":4},{"$f":"5","v":5},0]
[{"$nulls":4},{"$f":"VLOOKUP($C$5,Données!$A$4:$F$60,3)","v":"Salut, mon nom est Abigaïl"},{"$nulls":12},6,{"$f":"IF(R7<$Q$15+1,VLOOKUP(R7,Données!G10:H26,2),0)","v":2},{"$f":"5","v":5},0]
[{"$nulls":16},"Réponse choisie",7,{"$f":"IF(R8<$Q$15+1,VLOOKUP(R8,Données!G11:H27,2),0)","v":1},{"$f":"5","v":5},0]
[null,"P",{"$nulls":6},"           Cliquez sur les visages !     ",null,"P",{"$nulls":5},0,8,{"$f":"IF(R9<$Q$15+1,VLOOKUP(R9,Données!G12:H28,2),0)","v":1},{"$f":"5","v":5},0]
[{"$nulls":17},9,{"$f":"IF(R10<$Q$15+1,VLOOKUP(R10,Données!G13:H29,2),0)","v":1},{"$f":"5","v":5},0]
[{"$nulls":5},{"$f":"VLOOKUP($C$5,Données!$A$4:$F$60,4)","v":" Moi, je m'appelle Bélinda"},{"$nulls":10},"Nb rép. justes",10,{"$f":"IF(R11<$Q$15+1,VLOOKUP(R11,Données!G14:H30,2),0)","v":4},{"$f":"5","v":5},0]
[null,"E",{"$nulls":8},"E",{"$nulls":5},{"$f":"SUM(U1:U62)","v":0},11,{"$f":"IF(R12<$Q$15+1,VLOOKUP(R12,Données!G15:H31,2),0)","v":3},{"$f":"5","v":5},0]
[{"$nulls":17},12,{"$f":"IF(R13<$Q$15+1,VLOOKUP(R13,Données!G16:H32,2),0)","v":3},{"$f":"5","v":5},0]
[{"$nulls":16},"Nb de questions",13,{"$f":"IF(R14<$Q$15+1,VLOOKUP(R14,Données!G17:H33,2),0)","v":0},{"$f":"5","v":5},0]
[null,"R",{"$nulls":8},"R",{"$nulls":5},{"$f":"Données!A3","v":12},14,{"$f":"IF(R15<$Q$15+1,VLOOKUP(R15,Données!G18:H34,2),0)","v":0},{"$f":"5","v":5},0]
[{"$nulls":5},{"$f":"VLOOKUP($C$5,Données!$A$4:$F$60,5)","v":"... et moi Cédric"},{"$nulls":11},15,{"$f":"IF(R16<$Q$15+1,VLOOKUP(R16,Données!G19:H35,2),0)","v":0},{"$f":"5","v":5},0]
[{"$nulls":16},"Q'une réponse",16,{"$f":"IF(R17<$Q$15+1,VLOOKUP(R17,Données!G20:H36,2),0)","v":0},{"$f":"5","v":5},0]
[{"$nulls":16},false,17,{"$f":"IF(R18<$Q$15+1,VLOOKUP(R18,Données!G21:H37,2),0)","v":0},{"$f":"5","v":5},0]
[null,"Q",{"$nulls":8},"Q",{"$nulls":5},{"$f":"IF(Q18=TRUE,1,0)","v":0},18,{"$f":"IF(R19<$Q$15+1,VLOOKUP(R19,Données!G22:H38,2),0)","v":0},{"$f":"5","v":5},0]
[{"$nulls":5},{"$f":"VLOOKUP($C$5,Données!$A$4:$F$60,6)","v":"Hello, je suis Dennys"},{"$nulls":11},19,{"$f":"IF(R20<$Q$15+1,VLOOKUP(R20,Données!G23:H39,2),0)","v":0},{"$f":"5","v":5},0]
[{"$nulls":15},"R =","No question",20,{"$f":"IF(R21<$Q$15+1,VLOOKUP(R21,Données!G24:H40,2),0)","v":0},{"$f":"5","v":5},0]
[null,"U",{"$nulls":8},"U",{"$nulls":4},"S =","Rép. Juste",21,{"$f":"IF(R22<$Q$15+1,VLOOKUP(R22,Données!G25:H41,2),0)","v":0},{"$f":"5","v":5},0]
[{"$nulls":15},"T =","Rép. Donnée",22,{"$f":"IF(R23<$Q$15+1,VLOOKUP(R23,Données!G26:H42,2),0)","v":0},{"$f":"5","v":5},0]
[{"$nulls":15},"U =","0 faux - 1 juste",23,{"$f":"IF(R24<$Q$15+1,VLOOKUP(R24,Données!G27:H43,2),0)","v":0},{"$f":"5","v":5},0]
[null,"I",{"$f":"IF(Q9=0,\"\",\"Proposition de \" & VLOOKUP(Q9,Consignes!C20:E23,2))","v":""},{"$nulls":7},"I",{"$nulls":6},24,{"$f":"IF(R25<$Q$15+1,VLOOKUP(R25,Données!G28:H44,2),0)","v":0},{"$f":"5","v":5},0]
[{"$nulls":5},{"$f":"IF(Q9=0,\"\",VLOOKUP(C5,Données!G4:L60,Q9+2))","v":""},{"$nulls":11},25,{"$f":"IF(R26<$Q$15+1,VLOOKUP(R26,Données!G29:H45,2),0)","v":0},{"$f":"5","v":5},0]
[{"$nulls":3},{"$f":"IF(Q9=0,\"\",IF(Q9=VLOOKUP(C5,Données!G2:L60,2),\"JUSTE\",\"FAUX\"))","v":""},{"$nulls":13},26,{"$f":"IF(R27<$Q$15+1,VLOOKUP(R27,Données!G30:H46,2),0)","v":0},{"$f":"5","v":5},0]
[null,"Z",{"$nulls":6},"Justes :",{"$f":"Q12&\" / \"&Données!A3","v":"0 / 12"},"Z",{"$nulls":6},27,{"$f":"IF(R28<$Q$15+1,VLOOKUP(R28,Données!G31:H47,2),0)","v":0},{"$f":"5","v":5},0]
[{"$nulls":19},{"$f":"5","v":5}]
[{"$nulls":8},"Questions posées :",{"$f":"IF(C5=Q123+1,Q3-1,Q3)","v":0},{"$nulls":7},28,{"$f":"IF(R30<$Q$15+1,VLOOKUP(R30,Données!G32:H48,2),0)","v":0},{"$f":"5","v":5},0]
[{"$nulls":8},"Réponses données :",{"$f":"Q6","v":0},{"$nulls":7},29,{"$f":"IF(R31<$Q$15+1,VLOOKUP(R31,Données!G33:H49,2),0)","v":0},{"$f":"5","v":5},0]
[{"$nulls":9},"new  ",{"$nulls":7},30,{"$f":"IF(R32<$Q$15+1,VLOOKUP(R32,Données!G34:H50,2),0)","v":0},{"$f":"5","v":5},0]
[{"$nulls":17},31,{"$f":"IF(R33<$Q$15+1,VLOOKUP(R33,Données!G35:H51,2),0)","v":0},{"$f":"5","v":5},0]
[null,"Choix des portraits",{"$nulls":15},32,{"$f":"IF(R34<$Q$15+1,VLOOKUP(R34,Données!G36:H52,2),0)","v":0},{"$f":"5","v":5},0]
[null,{"$f":"C35-1","v":4},5,{"$nulls":14},33,{"$f":"IF(R35<$Q$15+1,VLOOKUP(R35,Données!G37:H53,2),0)","v":0},{"$f":"5","v":5},0]
[null,"Zoom",{"$nulls":15},34,{"$f":"IF(R36<$Q$15+1,VLOOKUP(R36,Données!G38:H54,2),0)","v":0},{"$f":"5","v":5},0]
[{"$nulls":17},35,{"$f":"IF(R37<$Q$15+1,VLOOKUP(R37,Données!G39:H55,2),0)","v":0},{"$f":"5","v":5},0]
[{"$nulls":7},"© Yvan Péguiron - infodidac.ch - rév. 12.03.11 compatible Excel Mac 2011",{"$nulls":9},36,{"$f":"IF(R38<$Q$15+1,VLOOKUP(R38,Données!G40:H56,2),0)","v":0},{"$f":"5","v":5},0]
[{"$nulls":17},37,{"$f":"IF(R39<$Q$15+1,VLOOKUP(R39,Données!G41:H57,2),0)","v":0},{"$f":"5","v":5},0]
[{"$nulls":17},38,{"$f":"IF(R40<$Q$15+1,VLOOKUP(R40,Données!G42:H58,2),0)","v":0},{"$f":"5","v":5},0]
[{"$nulls":17},39,{"$f":"IF(R41<$Q$15+1,VLOOKUP(R41,Données!G43:H59,2),0)","v":0},{"$f":"5","v":5},0]
[{"$nulls":17},40,{"$f":"IF(R42<$Q$15+1,VLOOKUP(R42,Données!G44:H60,2),0)","v":0},{"$f":"5","v":5},0]
[{"$nulls":17},41,{"$f":"IF(R43<$Q$15+1,VLOOKUP(R43,Données!G45:H61,2),0)","v":0},{"$f":"5","v":5},0]
[{"$nulls":17},42,{"$f":"IF(R44<$Q$15+1,VLOOKUP(R44,Données!G46:H62,2),0)","v":0},{"$f":"5","v":5},0]
[{"$nulls":17},43,{"$f":"IF(R45<$Q$15+1,VLOOKUP(R45,Données!G47:H63,2),0)","v":0},{"$f":"5","v":5},0]
[{"$nulls":17},44,{"$f":"IF(R46<$Q$15+1,VLOOKUP(R46,Données!G48:H64,2),0)","v":0},{"$f":"5","v":5},0]
[{"$nulls":17},45,{"$f":"IF(R47<$Q$15+1,VLOOKUP(R47,Données!G49:H65,2),0)","v":0},{"$f":"5","v":5},0]
[{"$nulls":17},46,{"$f":"IF(R48<$Q$15+1,VLOOKUP(R48,Données!G50:H66,2),0)","v":0},{"$f":"5","v":5},0]
[{"$nulls":17},47,{"$f":"IF(R49<$Q$15+1,VLOOKUP(R49,Données!G51:H67,2),0)","v":0},{"$f":"5","v":5},0]
[{"$nulls":17},48,{"$f":"IF(R50<$Q$15+1,VLOOKUP(R50,Données!G52:H68,2),0)","v":0},{"$f":"5","v":5},0]
[{"$nulls":17},49,{"$f":"IF(R51<$Q$15+1,VLOOKUP(R51,Données!G53:H69,2),0)","v":0},{"$f":"5","v":5},0]
[{"$nulls":17},50,{"$f":"IF(R52<$Q$15+1,VLOOKUP(R52,Données!G54:H70,2),0)","v":0},{"$f":"5","v":5},0]
[{"$nulls":17},51,{"$f":"IF(R53<$Q$15+1,VLOOKUP(R53,Données!G55:H71,2),0)","v":0},{"$f":"5","v":5},0]
[{"$nulls":17},52,{"$f":"IF(R54<$Q$15+1,VLOOKUP(R54,Données!G56:H72,2),0)","v":0},{"$f":"5","v":5},0]
[{"$nulls":17},53,{"$f":"IF(R55<$Q$15+1,VLOOKUP(R55,Données!G57:H73,2),0)","v":0},{"$f":"5","v":5},0]
[{"$nulls":17},54,{"$f":"IF(R56<$Q$15+1,VLOOKUP(R56,Données!G58:H74,2),0)","v":0},{"$f":"5","v":5},0]
[{"$nulls":17},55,{"$f":"IF(R57<$Q$15+1,VLOOKUP(R57,Données!G59:H75,2),0)","v":0},{"$f":"5","v":5},0]
[{"$nulls":17},56,{"$f":"IF(R58<$Q$15+1,VLOOKUP(R58,Données!G60:H76,2),0)","v":0},{"$f":"5","v":5},0]
[{"$nulls":17},57,{"$f":"IF(R59<$Q$15+1,VLOOKUP(R59,Données!G61:H77,2),0)","v":0},{"$f":"5","v":5},0]
[{"$nulls":17},58,{"$f":"IF(R60<$Q$15+1,VLOOKUP(R60,Données!G62:H78,2),0)","v":0},{"$f":"5","v":5},0]
{"$rows_left_out":3}
{"sheet":"Consignes","index":1,"n_rows":39,"n_cols":14,"rows_kept":39,"merged":[[1,1,2,1],[1,2,2,2],[1,3,2,3],[1,4,2,4],[1,5,2,5],[1,6,2,6],[1,7,2,7],[1,8,2,8],[1,9,2,9],[1,10,2,10],[1,11,2,11],[4,2,5,11],[6,2,7,11],[8,2,9,11],[11,3,14,10]]}
[]
[null,"S","U","P","E","R",null,"Q","U","I","Z"]
[]
[]
[null,null,"Le maître pose une question..."]
[]
[null,null,"...et quatre camarades te proposent des solutions."]
[]
[null,null,"      Un seul dit la vérité, à toi de trouver lequel !"]
[]
[]
[{"$nulls":3},"Clique sur le visage du maître pour obtenir une question, puis sur le visage du copain ou de la copine qui ne ment pas !"]
[]
[]
[]
[]
[]
[{"$nulls":4},"Tu peux changer ici le prénom des quatre camarades"]
[{"$nulls":3},"Choix ",1,2,3,4,5,6,7,8,9,10]
[null,null,1,{"$f":"HLOOKUP('  Q U I Z  '!$C$35,$E$19:$N$23,2)","v":"Abigaïl"},"Annie","Dinh Lam","Alizée","Angelina","Abigaïl","Arava","Kant","Touria","Madona","Amaris"]
[null,null,2,{"$f":"HLOOKUP('  Q U I Z  '!$C$35,$E$19:$N$23,3)","v":"Bélinda"},"Béa","Samîra","Brenda","Brooklyn","Bélinda","Bin-Ying","Rousseau","Arouna","Vanessa","Basile"]
[null,null,3,{"$f":"HLOOKUP('  Q U I Z  '!$C$35,$E$19:$N$23,4)","v":"Cédric"},"Chris","Marie","Charlène","Chloé","Cédric","Chama","Spinoza","Katsouko","George","Camellia"]
[null,null,4,{"$f":"HLOOKUP('  Q U I Z  '!$C$35,$E$19:$N$23,5)","v":"Dennys"},"Dan","Jacob","Donan","Diana","Dennys","Diatou","Descartes","Sébastien","Britney","Dahlia"]
[]
[null,"Règle du jeu pour un joueur :"]
[null,"Si la case en bas à gauche est cochée, le joueur n'a droit qu'à une seule réponse par question."]
[null,"Dans ce cas, le score indique le nombre de bonnes réponses du premier coup."]
[null,"Dans le cas contraire, il faudra analyser le rapport entre les questions posées et les réponses données."]
[]
[null,"Règle du jeu pour deux joueurs :"]
[null,"On tire au sort celui qui commence."]
[null,"Le premier joueur tire sa question et tente d'y répondre. S'il répond juste du premier coup il obtient"]
[null,"1 point, sinon zéro point; dans les deux cas il passe la main au deuxième joueur."]
[null,"Le deuxième joueur s'il peut répondre à la question du premier gagne 2 points puis tire sa question."]
[null,"Dans le cas où il se trompe également  alors il perd tout et passe la main en sautant son tour."]
[]
[]
[null,"Pour commencer une nouvelle partie, il faut cliquer sur le petit"]
[null,"carré gris du coin inférieur droite."]

{"sheet":"Données","index":2,"n_rows":44,"n_cols":16,"rows_kept":44,"hidden":true,"merged":[[1,2,1,5],[1,8,1,11]]}
[1,2,3,4,5,6,1,2,3,4,5,6]
["Total","Question","propositions",{"$nulls":3},"No","Rép.","Commentaires",{"$nulls":4},"Si qu'une réponse :",{"$f":"IF('  Q U I Z  '!Q18=TRUE,\"Non, désolé\",\"Cherche encore !\")","v":"Cherche encore !"},"Dommage!!"]
[{"$f":"COUNTA(C5:C45)","v":12},null,1,2,3,4,"Question","juste",1,2,3,4]
[0,"Cliquer sur ma tête pour obtenir une question d'économie",{"$f":"\"Salut, mon nom est \" & Consignes!D20","v":"Salut, mon nom est Abigaïl"},{"$f":"\" Moi, je m'appelle \" & Consignes!D21","v":" Moi, je m'appelle Bélinda"},{"$f":"\"... et moi \" & Consignes!D22","v":"... et moi Cédric"},{"$f":"\"Hello, je suis \" & Consignes!D23","v":"Hello, je suis Dennys"},0]
[1,"L’homme ne peut se procurer tous les biens dont il a besoin en raison de… ","La rareté des biens","L’abondance des biens","La hausse des prix de ces biens","Les progrès technologiques",1,1,{"$f":"IF(I$3=$H5,\"Bravo !\",$O$2)","v":"Bravo !"},{"$f":"IF(J$3=$H5,\"Bravo !\",$P$2)","v":"Dommage!!"},"Cherche encore !","Cherche encore !"]
[2,"Pour qu’un bien soit qualifié d’économique, il faut…","qu’il soit utile, mais pas rare","qu’il soit libre et rare","qu’il soit utile et rare","qu'il soit un bien de consommation",2,3,"Cherche encore !","Cherche encore !","Bravo !","Cherche encore !"]
[3,"La doctrine économique fondée sur la prospérité nationale et sur l’accumulation des réserves monétaires métalliques est :","La physiocratie","Le capitalisme","Le communisme","Le mercantilisme",3,4,"Cherche encore !","Cherche encore !","Cherche encore !","Bravo !"]
[4,"Dans une économie de marché, l’offre et la demande détermine le prix. On remarque dans la plupart de cas que…","si la demande augmente alors le prix augmente. ","la demande augmente, alors les prix baissent."," l’offre diminue, alors le prix diminue aussi."," l’offre augmente, alors le prix monte.",4,1,"Bravo !","Cherche encore !","Cherche encore !","Cherche encore !"]
[5,"L’économie planifiée…","a été appliquée dans toute l’Europe de 2000 à 2010","concerne la propriété privée des moyens de production","concerne la fixation des prix par le libre jeu de l’offre et la demande","concerne encore une  partie de la population mondiale",5,4,"Cherche encore !","Cherche encore !","Cherche encore !","Bravo !"]
[6,"La source d''énergie la plus utilisée est :","Le nucléaire","Le pétrole","L’énergie solaire","Le charbon",6,2,"Cherche encore !","Bravo !","Cherche encore !","Cherche encore !"]
[7,"Le secteur tertiaire  est très hétérogène , il regroupe…","les activités qui fournissent des services individuels ou collectifs","les activités dont le fondement matériel repose sur la terre et les ressources naturelles","les entreprises travaillant dans la transformation des matières premières","le secteur primaire et le secteur secondaire",7,1,"Bravo !","Cherche encore !","Cherche encore !","Cherche encore !"]
[8,"Une croissance économique est définie comme…","une augmentation soutenue de la quantité des biens et services que produit une économie","une augmentation soutenue de la quantité des biens et services importés par une économie","une diminution de la quantité des biens et services qu’exporte une économie","une diminution de la quantité des biens et services que consomme une économie",8,1,"Bravo !","Cherche encore !","Cherche encore !","Cherche encore !"]
[9,"Il existe une relation directe entre la croissance économique et le niveau de l’emploi dans un pays. Ces interactions peuvent se traduire de la manière suivante :","Si Croissance < Productivité, alors Emploi","Si Croissance > Productivité, alors Emploi","Si Croissance < Productivité, alors Chômage","Si Croissance = Productivité, alors Déséquilibre",9,1,"Bravo !","Cherche encore !","Cherche encore !","Cherche encore !"]
[10,"Le développement durable suppose…","une divergence entre les intérêts économiques et les objectifs écologiques à long terme ","une augmentation de la consommation des appareils ménagers","une production d’automobiles plus gourmandes en énergie","un meilleur rendement des ressources énergétiques utilisées",10,4,"Cherche encore !","Cherche encore !","Cherche encore !","Bravo !"]
[11,"On parle de déflation pour qualifier :","Une hausse du niveau général des prix.","Une sous-production généralisée.","Une grande quantité de monnaie en circulation.","Une baisse des revenus, des mises au chômage et finalement la faillite d’un grand nombre d’entreprises.",11,3,"Cherche encore !","Cherche encore !","Bravo !","Cherche encore !"]
[12,"Le libre-échange implique…","la présence de contingentements","un coût de fabrication maximal","un élargissement des marchés pour les produits nationaux","une offre a meilleur prix  ",12,3,"Cherche encore !","Cherche encore !","Bravo !","Cherche encore !"]
[13,"Fin du questionnaire",{"$nulls":4},13,null,{"$f":"IF(I$3=$H17,\"Bravo !\",$O$2)","v":"Cherche encore !"},"Cherche encore !","Cherche encore !","Cherche encore !"]
[14,{"$nulls":5},14,null,"Cherche encore !","Cherche encore !","Cherche encore !","Cherche encore !"]
[15,{"$nulls":5},15,null,"Cherche encore !","Cherche encore !","Cherche encore !","Cherche encore !"]
[16,{"$nulls":5},16,null,"Cherche encore !","Cherche encore !","Cherche encore !","Cherche encore !"]
[17,{"$nulls":5},17,null,"Cherche encore !","Cherche encore !","Cherche encore !","Cherche encore !"]
[18,{"$nulls":5},18,null,"Cherche encore !","Cherche encore !","Cherche encore !","Cherche encore !"]
[19,{"$nulls":5},19,null,"Cherche encore !","Cherche encore !","Cherche encore !","Cherche encore !"]
[20,{"$nulls":5},20,null,"Cherche encore !","Cherche encore !","Cherche encore !","Cherche encore !"]
[21,{"$nulls":5},21,null,"Cherche encore !","Cherche encore !","Cherche encore !","Cherche encore !"]
[22,{"$nulls":5},22,null,"Cherche encore !","Cherche encore !","Cherche encore !","Cherche encore !"]
[23,{"$nulls":5},23,null,"Cherche encore !","Cherche encore !","Cherche encore !","Cherche encore !"]
[24,{"$nulls":5},24,null,"Cherche encore !","Cherche encore !","Cherche encore !","Cherche encore !"]
[25,{"$nulls":5},25,null,"Cherche encore !","Cherche encore !","Cherche encore !","Cherche encore !"]
[26,{"$nulls":5},26,null,"Cherche encore !","Cherche encore !","Cherche encore !","Cherche encore !"]
[27,{"$nulls":5},27,null,"Cherche encore !","Cherche encore !","Cherche encore !","Cherche encore !"]
[28,{"$nulls":5},28,null,"Cherche encore !","Cherche encore !","Cherche encore !","Cherche encore !"]
[29,{"$nulls":5},29,null,"Cherche encore !","Cherche encore !","Cherche encore !","Cherche encore !"]
[30,{"$nulls":5},30,null,"Cherche encore !","Cherche encore !","Cherche encore !","Cherche encore !"]
[31,{"$nulls":5},31,null,"Cherche encore !","Cherche encore !","Cherche encore !","Cherche encore !"]
[32,{"$nulls":5},32,null,"Cherche encore !","Cherche encore !","Cherche encore !","Cherche encore !"]
[33,{"$nulls":5},33,null,"Cherche encore !","Cherche encore !","Cherche encore !","Cherche encore !"]
[34,{"$nulls":5},34,null,"Cherche encore !","Cherche encore !","Cherche encore !","Cherche encore !"]
[35,{"$nulls":5},35,null,"Cherche encore !","Cherche encore !","Cherche encore !","Cherche encore !"]
[36,{"$nulls":5},36,null,"Cherche encore !","Cherche encore !","Cherche encore !","Cherche encore !"]
[37,{"$nulls":5},37,null,"Cherche encore !","Cherche encore !","Cherche encore !","Cherche encore !"]
[38,{"$nulls":5},38,null,"Cherche encore !","Cherche encore !","Cherche encore !","Cherche encore !"]
[39,{"$nulls":5},39,null,"Cherche encore !","Cherche encore !","Cherche encore !","Cherche encore !"]
[40,{"$nulls":5},40,null,"Cherche encore !","Cherche encore !","Cherche encore !","Cherche encore !"]

{"sheet":"Version papier","index":3,"n_rows":217,"n_cols":5,"rows_kept":217,"merged":[[0,0,0,6],[2,1,3,1],[7,1,8,1],[12,1,13,1],[17,1,18,1],[22,1,23,1],[27,1,28,1],[32,2,32,3],[33,1,34,1],[38,1,39,1],[43,1,44,1],[48,1,49,1],[53,1,54,1],[58,1,59,1],[63,2,63,3],[64,1,65,1],[69,1,70,1],[74,1,75,1],[79,1,80,1],[84,1,85,1],[89,1,90,1],[94,2,94,3],[95,1,96,1],[100,1,101,1],[105,1,106,1],[110,1,111,1],[115,1,116,1],[120,1,121,1],[125,2,125,3],[126,1,127,1],[131,1,132,1],[136,1,137,1],[141,1,142,1],[146,1,147,1],[151,1,152,1],[156,2,156,3],[157,1,158,1],[162,1,163,1],[167,1,168,1],[172,1,173,1],[177,1,178,1],[182,1,183,1],[187,2,187,3],[188,1,189,1],[193,1,194,1],[198,1,199,1],[203,1,204,1],[208,1,209,1],[213,1,214,1]]}
["QCM \"Initiation à l'économie\""]
[]
[{"$f":"Données!A5","v":1},{"$f":"Données!B5","v":"L’homme ne peut se procurer tous les biens dont il a besoin en raison de… "},null,"A",{"$f":"Données!C5","v":"La rareté des biens"}]
[{"$nulls":3},"B",{"$f":"Données!D5","v":"L’abondance des biens"}]
[{"$nulls":3},"C",{"$f":"Données!E5","v":"La hausse des prix de ces biens"}]
[{"$nulls":3},"D",{"$f":"Données!F5","v":"Les progrès technologiques"}]
[]
[{"$f":"Données!A6","v":2},{"$f":"Données!B6","v":"Pour qu’un bien soit qualifié d’économique, il faut…"},null,"A",{"$f":"Données!C6","v":"qu’il soit utile, mais pas rare"}]
[{"$nulls":3},"B",{"$f":"Données!D6","v":"qu’il soit libre et rare"}]
[{"$nulls":3},"C",{"$f":"Données!E6","v":"qu’il soit utile et rare"}]
[{"$nulls":3},"D",{"$f":"Données!F6","v":"qu'il soit un bien de consommation"}]
[]
[{"$f":"Données!A7","v":3},{"$f":"Données!B7","v":"La doctrine économique fondée sur la prospérité nationale et sur l’accumulation des réserves monétaires métalliques est :"},null,"A",{"$f":"Données!C7","v":"La physiocratie"}]
[{"$nulls":3},"B",{"$f":"Données!D7","v":"Le capitalisme"}]
[{"$nulls":3},"C",{"$f":"Données!E7","v":"Le communisme"}]
[{"$nulls":3},"D",{"$f":"Données!F7","v":"Le mercantilisme"}]
[]
[{"$f":"Données!A8","v":4},{"$f":"Données!B8","v":"Dans une économie de marché, l’offre et la demande détermine le prix. On remarque dans la plupart de cas que…"},null,"A",{"$f":"Données!C8","v":"si la demande augmente alors le prix augmente. "}]
[{"$nulls":3},"B",{"$f":"Données!D8","v":"la demande augmente, alors les prix baissent."}]
[{"$nulls":3},"C",{"$f":"Données!E8","v":" l’offre diminue, alors le prix diminue aussi."}]
[{"$nulls":3},"D",{"$f":"Données!F8","v":" l’offre augmente, alors le prix monte."}]
[]
[{"$f":"Données!A9","v":5},{"$f":"Données!B9","v":"L’économie planifiée…"},null,"A",{"$f":"Données!C9","v":"a été appliquée dans toute l’Europe de 2000 à 2010"}]
[{"$nulls":3},"B",{"$f":"Données!D9","v":"concerne la propriété privée des moyens de production"}]
[{"$nulls":3},"C",{"$f":"Données!E9","v":"concerne la fixation des prix par le libre jeu de l’offre et la demande"}]
[{"$nulls":3},"D",{"$f":"Données!F9","v":"concerne encore une  partie de la population mondiale"}]
[]
[{"$f":"Données!A10","v":6},{"$f":"Données!B10","v":"La source d''énergie la plus utilisée est :"},null,"A",{"$f":"Données!C10","v":"Le nucléaire"}]
[{"$nulls":3},"B",{"$f":"Données!D10","v":"Le pétrole"}]
[{"$nulls":3},"C",{"$f":"Données!E10","v":"L’énergie solaire"}]
[{"$nulls":3},"D",{"$f":"Données!F10","v":"Le charbon"}]
[]
[null,null,"page 2"]
[{"$f":"Données!A11","v":7},{"$f":"Données!B11","v":"Le secteur tertiaire  est très hétérogène , il regroupe…"},null,"A",{"$f":"Données!C11","v":"les activités qui fournissent des services individuels ou collectifs"}]
[{"$nulls":3},"B",{"$f":"Données!D11","v":"les activités dont le fondement matériel repose sur la terre et les ressources naturelles"}]
[{"$nulls":3},"C",{"$f":"Données!E11","v":"les entreprises travaillant dans la transformation des matières premières"}]
[{"$nulls":3},"D",{"$f":"Données!F11","v":"le secteur primaire et le secteur secondaire"}]
[]
[{"$f":"Données!A12","v":8},{"$f":"Données!B12","v":"Une croissance économique est définie comme…"},null,"A",{"$f":"Données!C12","v":"une augmentation soutenue de la quantité des biens et services que produit une économie"}]
[{"$nulls":3},"B",{"$f":"Données!D12","v":"une augmentation soutenue de la quantité des biens et services importés par une économie"}]
[{"$nulls":3},"C",{"$f":"Données!E12","v":"une diminution de la quantité des biens et services qu’exporte une économie"}]
[{"$nulls":3},"D",{"$f":"Données!F12","v":"une diminution de la quantité des biens et services que consomme une économie"}]
[]
[{"$f":"Données!A12","v":8},{"$f":"Données!B12","v":"Une croissance économique est définie comme…"},null,"A",{"$f":"Données!C12","v":"une augmentation soutenue de la quantité des biens et services que produit une économie"}]
[{"$nulls":3},"B",{"$f":"Données!D12","v":"une augmentation soutenue de la quantité des biens et services importés par une économie"}]
[{"$nulls":3},"C",{"$f":"Données!E12","v":"une diminution de la quantité des biens et services qu’exporte une économie"}]
[{"$nulls":3},"D",{"$f":"Données!F12","v":"une diminution de la quantité des biens et services que consomme une économie"}]
[]
[{"$f":"Données!A13","v":9},{"$f":"Données!B13","v":"Il existe une relation directe entre la croissance économique et le niveau de l’emploi dans un pays. Ces interactions peuvent se traduire de la manière suivante :"},null,"A",{"$f":"Données!C13","v":"Si Croissance < Productivité, alors Emploi"}]
[{"$nulls":3},"B",{"$f":"Données!D13","v":"Si Croissance > Productivité, alors Emploi"}]
[{"$nulls":3},"C",{"$f":"Données!E13","v":"Si Croissance < Productivité, alors Chômage"}]
[{"$nulls":3},"D",{"$f":"Données!F13","v":"Si Croissance = Productivité, alors Déséquilibre"}]
[]
[{"$f":"Données!A14","v":10},{"$f":"Données!B14","v":"Le développement durable suppose…"},null,"A",{"$f":"Données!C14","v":"une divergence entre les intérêts économiques et les objectifs écologiques à long terme "}]
[{"$nulls":3},"B",{"$f":"Données!D14","v":"une augmentation de la consommation des appareils ménagers"}]
[{"$nulls":3},"C",{"$f":"Données!E14","v":"une production d’automobiles plus gourmandes en énergie"}]
[{"$nulls":3},"D",{"$f":"Données!F14","v":"un meilleur rendement des ressources énergétiques utilisées"}]
[]
[{"$f":"Données!A15","v":11},{"$f":"Données!B15","v":"On parle de déflation pour qualifier :"},null,"A",{"$f":"Données!C15","v":"Une hausse du niveau général des prix."}]
[{"$nulls":3},"B",{"$f":"Données!D15","v":"Une sous-production généralisée."}]
{"$rows_left_out":158}
{"sheet":"Galerie","index":4,"n_rows":17,"n_cols":40,"rows_kept":17,"hidden":true}
[{"$nulls":26},"Kids","Religions","Ecoliers","Styles","Jeunes","Monde","Philosophes","Races","Stars","Clip"]
[{"$nulls":14},"Prof",{"$nulls":24},1]
[{"$nulls":14},"Choix 1"]
[{"$nulls":14},"Choix 2"]
[{"$nulls":14},"Choix 3"]
[{"$nulls":14},"Choix 4"]
[{"$nulls":26},"Menu"]
[{"$nulls":26},{"$f":"AA1","v":"Kids"}]
[{"$nulls":26},{"$f":"AB1","v":"Religions"}]
[{"$nulls":26},{"$f":"AC1","v":"Ecoliers"}]
[{"$nulls":26},{"$f":"AD1","v":"Styles"}]
[{"$nulls":26},{"$f":"AE1","v":"Jeunes"}]
[{"$nulls":26},{"$f":"AF1","v":"Monde"}]
[{"$nulls":26},{"$f":"AG1","v":"Philosophes"}]
[{"$nulls":26},{"$f":"AH1","v":"Races"}]
[{"$nulls":26},"Stars"]
[{"$nulls":26},"Clip"]