{"text_format":"1","workbook":"xlsx","n_sheets":3,"sheets":["Accueil","Feuil1","Feuil2"],"not_rendered":{"charts":0,"images":2,"macros":1,"external_links":0,"defined_names":0,"comments":0,"pivot_tables":0},"unopened":[],"bounds":{"document_bytes":16777216,"sheet_cells":100000,"rows_first":2000,"rows_last":500,"rows_between":2000,"halvings":0,"cell_chars":16384,"cell_head_chars":4096},"cells_cut":0,"cells_raw":0,"read":"whole","date_system":"1900"}

{"sheet":"Accueil","index":0,"n_rows":44,"n_cols":13,"rows_kept":44,"cut":false,"hidden":false,"merged":[[0,0,0,11]]}
["Drill de comptabilité pour entraîner la notion de flux"]
[]
["Cette version informatique reprend le jeu de plateau \"Drill compta\" et permet de simuler le jeu sur ordinateur…"]
[]
["Ci-dessous, les règles du jeu de la version originale "]
[]
[]
[]
[]
[]
[]
[]
[]
[]
[]
[]
[]
[]
[]
[]
[]
[]
[]
[]
[]
[]
[]
[]
[]
["Dans cette version, un clic sur la zone ad'hoc remplace le placement des cubes."]
[]
["Règles pour cette version :"]
["1) Cliquer sur la zone d'origine du flux."]
["2) Cliquer sur la zone de destination du flux."]
["3) Cliquer sur le bouton \"correction\" pour obtenir l'évaluation de la réponse."]
["     Les compteurs indiquent respectivement si l'origine et la destination sont justes. (Compteur en rouge = réponse fausse)"]
[]
["4) Ctrl + s permet de visualiser la solution en cas de réponse fausse. (Cette option est volontairement cachée)"]
[]
[]
[]
[]
["PS : Les modification ou adjonction d'opérations se font dans la feuille 2 de ce classeur Excel."]
["       Les boutons à options situés sous le tableau permettent d'afficher sur demande la nature des comptes. (Actif, Passif, Charges, Produits)",null,null,null,null,null,null,null,null,null,null,null,"© Yvan Péguiron 2004 - Mac2011"]

{"sheet":"Feuil1","index":1,"n_rows":50,"n_cols":19,"rows_kept":50,"cut":false,"hidden":false,"merged":[[47,15,47,16],[20,14,20,15],[21,14,23,15],[1,2,1,15],[17,14,19,15],[44,4,45,4],[44,8,45,8],[25,14,25,15],[26,14,27,15],[43,2,43,4],[43,6,43,8],[42,5,42,7]]}
[]
[null,33,{"$f":"VLOOKUP(B2,Feuil2!B1:C60,2)","v":"Achat d'une voiture contre facture"}]
[null,null,null,null,null,null,null,null,null,null,null,null,null,null,null,null,null,"Clic","zoom"]
[null,null,null,null,null,null,null,null,null,null,null,null,null,null,null,null,null,0,90]
[null,null,null,null,null,null,null,null,null,null,null,null,null,null,null,null,null,"Réponse","OK"]
[null,null,null,null,null,null,null,null,null,null,null,null,null,null,null,null,null,{"$f":"VALUE(E43 & I43)","v":{"$error":"#VALUE!"}},{"$f":"VLOOKUP(B2,Feuil2!B1:D60,3)","v":61}]
[null,null,null,null,null,null,null,null,null,null,null,null,null,null,null,null,null,"choix","correc"]
[null,null,null,null,null,null,null,null,null,null,null,null,null,null,null,null,null,0,false]
[]
[]
[]
[]
[]
[]
[]
[]
[]
[]
[]
[]
[null,null,null,null,null,null,null,null,null,null,null,null,null,null,{"$f":"IF(O18=\"\",\"\",\"annule ton choix !\")","v":""}]
[null,null,null,null,null,null,null,null,null,null,null,null,null,null,{"$f":"IF(R6=S6,\"Bravo\",\"N o n !\")","v":{"$error":"#VALUE!"}}]
[]
[]
[]
[null,null,null,null,null,null,null,null,null,null,null,null,null,null,"Bonne réponse :"]
[null,null,null,null,null,null,null,null,null,null,null,null,null,null,{"$f":"S6","v":61}]
[]
[]
[]
[]
[]
[]
[]
[]
[]
[]
[]
[]
[]
[]
[null,null,null,null,null,null,null,null,null,null,null,null,null,null,"Corrections :",1]
[null,null,"Origine du flux :",null,null,"Destination du flux :",null,null,null,null,null,null,null,null,"Justes :",0]
[null,null,{"$f":"IF(E43=\"\",\"\",VLOOKUP(E43,Feuil2!H3:I10,2))","v":""},null,null,null,{"$f":"IF(I43=\"\",\"\",VLOOKUP(I43,Feuil2!H3:I10,2))","v":""},null,null,null,null,null,null,null,"   Origines                    0","Destinations       0"]
[]
[]
[]
[null,"Nature des comptes",null,null,null,null,null,null,null,null,null,null,null,null,null,"zoom"]
[]
[null,"Touche correction "]

{"sheet":"Feuil2","index":2,"n_rows":63,"n_cols":9,"rows_kept":63,"cut":false,"hidden":false,"merged":[]}
[null,"No","Question","or/des","débit","crédit",null,"Solution avec Ctrl + s"]
[null,0,"Début du jeu"]
[null,1,"J'achète des outils au comptant",21,"A+","A-",null,1,"Actif + (débit)"]
[null,2,"J'achète de la matière première à crédit",63,"ch+","P+",null,2,"Actif - (crédit)"]
[null,3,"Je reçois la facture pour l'achat d'une machine",61,"A+","P+",null,3,"Charges + (débit)"]
[null,4,"Je rembourse par poste un prêt bancaire",25,"P-","A-",null,4,"Charges - (crédit)"]
[null,5,"Je vends des marchandises au comptant",81,"A+","pr+",null,5,"Passif - (débit)"]
[null,6,"Je paie mon loyer",23,"ch+","A-",null,6,"Passif + (crédit)"]
[null,7,"Je vends au comptant une voiture de livraison",21,"A+","A-",null,7,"Produits - (débit)"]
[null,8,"J'achète, avec mon EC, deux pneus pour l'arrière du tracteur",21,"A+","A-",null,8,"Produits + (crédit)"]
[null,9,"Encaissé une subvention",81,"A+","pr+"]
[null,10,"Je paie cash la facture du garage (service)",23,"ch+","A-"]
[null,11,"Encaissé des loyers",81,"A+","pr+"]
[null,12,"Facturé à un client la location d'une machine",81,"A+","pr+"]
[null,13,"Payé par banque les salaires de la semaine",23,"ch+","A-"]
[null,14,"Payé par poste un fournisseur",25,"P-","A-"]
[null,15,"Prélevé sur le compte \"Prêt bancaire\"",61,"A+","P+"]
[null,16,"Virement postal d'un client",21,"A+","A-"]
[null,17,"Vendu à crédit",81,"A+","pr+"]
[null,18,"Utilisé le prêt bancaire pour payer une facture de marchandises",65,"P-","P+"]
[null,19,"Accordé un rabais à un bon client",27,"pr-","A-"]
[null,20,"Payé électicité par poste",23,"ch+","A-"]
[null,21,"Achat d'une machine de chantier à crédit",61,"A+","P+"]
[null,22,"Facturé des travaux à un client",81,"A+","pr+"]
[null,23,"Paiement des salaires par virements postaux",23,"ch+","A-"]
[null,24,"Reçu la facture du mécanicien pour l'entretien d'une machine",63,"ch+","P+"]
[null,25,"Payé la facture d'une machine de chantier grâce à un emprunt bancaire",65,"P-","P+"]
[null,26,"Comptabilisé le loyer du concierge pour l'appartement dans l'immeuble",83,"ch+","pr+"]
[null,27,"Retrait au bancomat ",21,"A+","A-"]
[null,28,"Payé par poste la note d'électricité",23,"ch+","A-"]
[null,29,"Versement d'un client à ma banque (Compte de dépôts)",21,"A+","A-"]
[null,30,"Payé par poste la facture du mécanicien",25,"P-","A-"]
[null,31,"Rabais accordé à un client en difficultés",27,"pr-","A-"]
[null,32,"Payé comptant une publicité locale",23,"ch+","A-"]
[null,33,"Achat d'une voiture contre facture",61,"A+","P+"]
[null,34,"Remise accordée par le garagiste sur l'achat de la voiture",25,"P-","A+"]
[null,35,"Achat de pneus d'hiver (frais véhicules) contre facture",63,"ch+","P+"]
[null,36,"Escompte obtenu sur l'achat de pneus voiture",45,"P-","ch-"]
[null,37,"Vendu la voiture de livraison à un créancier",25,"P-","A-"]
[null,38,"Facturé des travaux à un fournisseur",85,"P-","pr+"]
[null,39,"Remboursement d'une prime d'assurance payée à double",41,"A+","ch-"]
[null,40,"Vente de benzine de la semaine",81,"A+","pr+"]
[null,41]
[null,42]
[null,43]
[null,44]
[null,45]
[null,46]
[null,47]
[null,48]
[null,49]
[null,50]
[null,51]
[null,52]
[null,53]
[null,54]
[null,55]
[null,56]
[null,57]
[null,58]
[null,59]
[null,60]
["Total questions",null,{"$f":"60-COUNTIF(C2:C62,\"\")","v":40}]