{"text_format":"1","workbook":"xlsx","n_sheets":2,"sheets":["Journal","Compte"],"not_rendered":{"charts":0,"images":0,"macros":1,"external_links":0,"defined_names":4,"comments":1,"pivot_tables":0},"unopened":[],"bounds":{"document_bytes":16777216,"sheet_cells":100000,"rows_first":2000,"rows_last":500,"rows_between":2000,"halvings":0,"cell_chars":16384,"cell_head_chars":4096},"cells_cut":0,"cells_raw":0,"read":"whole","date_system":"1900"}

{"sheet":"Journal","index":0,"n_rows":258,"n_cols":17,"rows_kept":258,"cut":false,"hidden":false,"merged":[[5,1,5,7],[6,2,6,3],[6,4,6,5]]}
[]
[]
[]
[]
[null,null,null,null,null,null,null,{"$f":"I5","v":0},{"$f":"COUNTA(H8:H258)","v":0}]
[null,"JOURNAL"]
[null,"Date (31.12)","Débit",null,"Crédit",null,"Libellé","Somme"]
[null,null,null,{"$f":"IF(C8>0,VLOOKUP(C8,Miniplan,2),\"\")","v":""},null,{"$f":"IF(E8>0,VLOOKUP(E8,Miniplan,2),\"\")","v":""},null,null,{"$f":"IF($H8=\"\",\"\",IF(C8=\"\",\"\",LOOKUP(C8,Miniplan,Compte!$S$8:$S$52)))","v":""},{"$f":"IF($H8=\"\",\"\",IF(E8=\"\",\"\",LOOKUP(E8,Miniplan,Compte!$S$8:$S$52)))","v":""}]
[null,null,null,"",null,{"$f":"IF(E9>0,VLOOKUP(E9,Miniplan,2),\"\")","v":""},null,null,{"$f":"IF($H9=\"\",\"\",IF(C9=\"\",\"\",LOOKUP(C9,Miniplan,Compte!$S$8:$S$52)))","v":""},{"$f":"IF($H9=\"\",\"\",IF(E9=\"\",\"\",LOOKUP(E9,Miniplan,Compte!$S$8:$S$52)))","v":""}]
[null,null,null,"",null,"",null,null,{"$f":"IF($H10=\"\",\"\",IF(C10=\"\",\"\",LOOKUP(C10,Miniplan,Compte!$S$8:$S$52)))","v":""},{"$f":"IF($H10=\"\",\"\",IF(E10=\"\",\"\",LOOKUP(E10,Miniplan,Compte!$S$8:$S$52)))","v":""}]
[null,null,null,"",null,"",null,null,{"$f":"IF($H11=\"\",\"\",IF(C11=\"\",\"\",LOOKUP(C11,Miniplan,Compte!$S$8:$S$52)))","v":""},{"$f":"IF($H11=\"\",\"\",IF(E11=\"\",\"\",LOOKUP(E11,Miniplan,Compte!$S$8:$S$52)))","v":""}]
[null,null,null,"",null,"",null,null,{"$f":"IF($H12=\"\",\"\",IF(C12=\"\",\"\",LOOKUP(C12,Miniplan,Compte!$S$8:$S$52)))","v":""},{"$f":"IF($H12=\"\",\"\",IF(E12=\"\",\"\",LOOKUP(E12,Miniplan,Compte!$S$8:$S$52)))","v":""}]
[null,null,null,"",null,"",null,null,{"$f":"IF($H13=\"\",\"\",IF(C13=\"\",\"\",LOOKUP(C13,Miniplan,Compte!$S$8:$S$52)))","v":""},{"$f":"IF($H13=\"\",\"\",IF(E13=\"\",\"\",LOOKUP(E13,Miniplan,Compte!$S$8:$S$52)))","v":""}]
[null,null,null,"",null,"",null,null,{"$f":"IF($H14=\"\",\"\",IF(C14=\"\",\"\",LOOKUP(C14,Miniplan,Compte!$S$8:$S$52)))","v":""},{"$f":"IF($H14=\"\",\"\",IF(E14=\"\",\"\",LOOKUP(E14,Miniplan,Compte!$S$8:$S$52)))","v":""}]
[null,null,null,"",null,"",null,null,{"$f":"IF($H15=\"\",\"\",IF(C15=\"\",\"\",LOOKUP(C15,Miniplan,Compte!$S$8:$S$52)))","v":""},{"$f":"IF($H15=\"\",\"\",IF(E15=\"\",\"\",LOOKUP(E15,Miniplan,Compte!$S$8:$S$52)))","v":""}]
[null,null,null,"",null,"",null,null,{"$f":"IF($H16=\"\",\"\",IF(C16=\"\",\"\",LOOKUP(C16,Miniplan,Compte!$S$8:$S$52)))","v":""},{"$f":"IF($H16=\"\",\"\",IF(E16=\"\",\"\",LOOKUP(E16,Miniplan,Compte!$S$8:$S$52)))","v":""}]
[null,null,null,"",null,"",null,null,{"$f":"IF($H17=\"\",\"\",IF(C17=\"\",\"\",LOOKUP(C17,Miniplan,Compte!$S$8:$S$52)))","v":""},{"$f":"IF($H17=\"\",\"\",IF(E17=\"\",\"\",LOOKUP(E17,Miniplan,Compte!$S$8:$S$52)))","v":""}]
[null,null,null,"",null,"",null,null,{"$f":"IF($H18=\"\",\"\",IF(C18=\"\",\"\",LOOKUP(C18,Miniplan,Compte!$S$8:$S$52)))","v":""},{"$f":"IF($H18=\"\",\"\",IF(E18=\"\",\"\",LOOKUP(E18,Miniplan,Compte!$S$8:$S$52)))","v":""}]
[null,null,null,"",null,"",null,null,{"$f":"IF($H19=\"\",\"\",IF(C19=\"\",\"\",LOOKUP(C19,Miniplan,Compte!$S$8:$S$52)))","v":""},{"$f":"IF($H19=\"\",\"\",IF(E19=\"\",\"\",LOOKUP(E19,Miniplan,Compte!$S$8:$S$52)))","v":""},null,null,null,null,null,null,{"$f":"IF(L19=\"\",\"\",Q18+O19-P19)","v":""}]
[null,null,null,"",null,"",null,null,{"$f":"IF($H20=\"\",\"\",IF(C20=\"\",\"\",LOOKUP(C20,Miniplan,Compte!$S$8:$S$52)))","v":""},{"$f":"IF($H20=\"\",\"\",IF(E20=\"\",\"\",LOOKUP(E20,Miniplan,Compte!$S$8:$S$52)))","v":""},null,null,null,null,null,null,""]
[null,null,null,"",null,"",null,null,{"$f":"IF($H21=\"\",\"\",IF(C21=\"\",\"\",LOOKUP(C21,Miniplan,Compte!$S$8:$S$52)))","v":""},{"$f":"IF($H21=\"\",\"\",IF(E21=\"\",\"\",LOOKUP(E21,Miniplan,Compte!$S$8:$S$52)))","v":""},null,null,null,null,null,null,""]
[null,null,null,"",null,"",null,null,{"$f":"IF($H22=\"\",\"\",IF(C22=\"\",\"\",LOOKUP(C22,Miniplan,Compte!$S$8:$S$52)))","v":""},{"$f":"IF($H22=\"\",\"\",IF(E22=\"\",\"\",LOOKUP(E22,Miniplan,Compte!$S$8:$S$52)))","v":""},null,null,null,null,null,null,""]
[null,null,null,"",null,"",null,null,{"$f":"IF($H23=\"\",\"\",IF(C23=\"\",\"\",LOOKUP(C23,Miniplan,Compte!$S$8:$S$52)))","v":""},{"$f":"IF($H23=\"\",\"\",IF(E23=\"\",\"\",LOOKUP(E23,Miniplan,Compte!$S$8:$S$52)))","v":""},null,null,null,null,null,null,""]
[null,null,null,"",null,"",null,null,{"$f":"IF($H24=\"\",\"\",IF(C24=\"\",\"\",LOOKUP(C24,Miniplan,Compte!$S$8:$S$52)))","v":""},{"$f":"IF($H24=\"\",\"\",IF(E24=\"\",\"\",LOOKUP(E24,Miniplan,Compte!$S$8:$S$52)))","v":""},null,null,null,null,null,null,""]
[null,null,null,"",null,"",null,null,{"$f":"IF($H25=\"\",\"\",IF(C25=\"\",\"\",LOOKUP(C25,Miniplan,Compte!$S$8:$S$52)))","v":""},{"$f":"IF($H25=\"\",\"\",IF(E25=\"\",\"\",LOOKUP(E25,Miniplan,Compte!$S$8:$S$52)))","v":""},null,null,null,null,null,null,""]
[null,null,null,"",null,"",null,null,{"$f":"IF($H26=\"\",\"\",IF(C26=\"\",\"\",LOOKUP(C26,Miniplan,Compte!$S$8:$S$52)))","v":""},{"$f":"IF($H26=\"\",\"\",IF(E26=\"\",\"\",LOOKUP(E26,Miniplan,Compte!$S$8:$S$52)))","v":""},null,null,null,null,null,null,""]
[null,null,null,"",null,"",null,null,{"$f":"IF($H27=\"\",\"\",IF(C27=\"\",\"\",LOOKUP(C27,Miniplan,Compte!$S$8:$S$52)))","v":""},{"$f":"IF($H27=\"\",\"\",IF(E27=\"\",\"\",LOOKUP(E27,Miniplan,Compte!$S$8:$S$52)))","v":""},null,null,null,null,null,null,""]
[null,null,null,"",null,"",null,null,{"$f":"IF($H28=\"\",\"\",IF(C28=\"\",\"\",LOOKUP(C28,Miniplan,Compte!$S$8:$S$52)))","v":""},{"$f":"IF($H28=\"\",\"\",IF(E28=\"\",\"\",LOOKUP(E28,Miniplan,Compte!$S$8:$S$52)))","v":""},null,null,null,null,null,null,""]
[null,null,null,"",null,"",null,null,{"$f":"IF($H29=\"\",\"\",IF(C29=\"\",\"\",LOOKUP(C29,Miniplan,Compte!$S$8:$S$52)))","v":""},{"$f":"IF($H29=\"\",\"\",IF(E29=\"\",\"\",LOOKUP(E29,Miniplan,Compte!$S$8:$S$52)))","v":""},null,null,null,null,null,null,""]
[null,null,null,"",null,"",null,null,{"$f":"IF($H30=\"\",\"\",IF(C30=\"\",\"\",LOOKUP(C30,Miniplan,Compte!$S$8:$S$52)))","v":""},{"$f":"IF($H30=\"\",\"\",IF(E30=\"\",\"\",LOOKUP(E30,Miniplan,Compte!$S$8:$S$52)))","v":""},null,null,null,null,null,null,""]
[null,null,null,"",null,"",null,null,{"$f":"IF($H31=\"\",\"\",IF(C31=\"\",\"\",LOOKUP(C31,Miniplan,Compte!$S$8:$S$52)))","v":""},{"$f":"IF($H31=\"\",\"\",IF(E31=\"\",\"\",LOOKUP(E31,Miniplan,Compte!$S$8:$S$52)))","v":""},null,null,null,null,null,null,""]
[null,null,null,"",null,"",null,null,{"$f":"IF($H32=\"\",\"\",IF(C32=\"\",\"\",LOOKUP(C32,Miniplan,Compte!$S$8:$S$52)))","v":""},{"$f":"IF($H32=\"\",\"\",IF(E32=\"\",\"\",LOOKUP(E32,Miniplan,Compte!$S$8:$S$52)))","v":""},null,null,null,null,null,null,""]
[null,null,null,"",null,"",null,null,{"$f":"IF($H33=\"\",\"\",IF(C33=\"\",\"\",LOOKUP(C33,Miniplan,Compte!$S$8:$S$52)))","v":""},{"$f":"IF($H33=\"\",\"\",IF(E33=\"\",\"\",LOOKUP(E33,Miniplan,Compte!$S$8:$S$52)))","v":""},null,null,null,null,null,null,""]
[null,null,null,"",null,"",null,null,{"$f":"IF($H34=\"\",\"\",IF(C34=\"\",\"\",LOOKUP(C34,Miniplan,Compte!$S$8:$S$52)))","v":""},{"$f":"IF($H34=\"\",\"\",IF(E34=\"\",\"\",LOOKUP(E34,Miniplan,Compte!$S$8:$S$52)))","v":""},null,null,null,null,null,null,""]
[null,null,null,"",null,"",null,null,{"$f":"IF($H35=\"\",\"\",IF(C35=\"\",\"\",LOOKUP(C35,Miniplan,Compte!$S$8:$S$52)))","v":""},{"$f":"IF($H35=\"\",\"\",IF(E35=\"\",\"\",LOOKUP(E35,Miniplan,Compte!$S$8:$S$52)))","v":""},null,null,null,null,null,null,""]
[null,null,null,"",null,"",null,null,{"$f":"IF($H36=\"\",\"\",IF(C36=\"\",\"\",LOOKUP(C36,Miniplan,Compte!$S$8:$S$52)))","v":""},{"$f":"IF($H36=\"\",\"\",IF(E36=\"\",\"\",LOOKUP(E36,Miniplan,Compte!$S$8:$S$52)))","v":""},null,null,null,null,null,null,""]
[null,null,null,"",null,"",null,null,{"$f":"IF($H37=\"\",\"\",IF(C37=\"\",\"\",LOOKUP(C37,Miniplan,Compte!$S$8:$S$52)))","v":""},{"$f":"IF($H37=\"\",\"\",IF(E37=\"\",\"\",LOOKUP(E37,Miniplan,Compte!$S$8:$S$52)))","v":""},null,null,null,null,null,null,""]
[null,null,null,"",null,"",null,null,{"$f":"IF($H38=\"\",\"\",IF(C38=\"\",\"\",LOOKUP(C38,Miniplan,Compte!$S$8:$S$52)))","v":""},{"$f":"IF($H38=\"\",\"\",IF(E38=\"\",\"\",LOOKUP(E38,Miniplan,Compte!$S$8:$S$52)))","v":""},null,null,null,null,null,null,""]
[null,null,null,"",null,"",null,null,{"$f":"IF($H39=\"\",\"\",IF(C39=\"\",\"\",LOOKUP(C39,Miniplan,Compte!$S$8:$S$52)))","v":""},{"$f":"IF($H39=\"\",\"\",IF(E39=\"\",\"\",LOOKUP(E39,Miniplan,Compte!$S$8:$S$52)))","v":""},null,null,null,null,null,null,""]
[null,null,null,"",null,"",null,null,{"$f":"IF($H40=\"\",\"\",IF(C40=\"\",\"\",LOOKUP(C40,Miniplan,Compte!$S$8:$S$52)))","v":""},{"$f":"IF($H40=\"\",\"\",IF(E40=\"\",\"\",LOOKUP(E40,Miniplan,Compte!$S$8:$S$52)))","v":""},null,null,null,null,null,null,""]
[null,null,null,"",null,"",null,null,{"$f":"IF($H41=\"\",\"\",IF(C41=\"\",\"\",LOOKUP(C41,Miniplan,Compte!$S$8:$S$52)))","v":""},{"$f":"IF($H41=\"\",\"\",IF(E41=\"\",\"\",LOOKUP(E41,Miniplan,Compte!$S$8:$S$52)))","v":""},null,null,null,null,null,null,""]
[null,null,null,"",null,"",null,null,{"$f":"IF($H42=\"\",\"\",IF(C42=\"\",\"\",LOOKUP(C42,Miniplan,Compte!$S$8:$S$52)))","v":""},{"$f":"IF($H42=\"\",\"\",IF(E42=\"\",\"\",LOOKUP(E42,Miniplan,Compte!$S$8:$S$52)))","v":""},null,null,null,null,null,null,""]
[null,null,null,"",null,"",null,null,{"$f":"IF($H43=\"\",\"\",IF(C43=\"\",\"\",LOOKUP(C43,Miniplan,Compte!$S$8:$S$52)))","v":""},{"$f":"IF($H43=\"\",\"\",IF(E43=\"\",\"\",LOOKUP(E43,Miniplan,Compte!$S$8:$S$52)))","v":""},null,null,null,null,null,null,""]
[null,null,null,"",null,"",null,null,{"$f":"IF($H44=\"\",\"\",IF(C44=\"\",\"\",LOOKUP(C44,Miniplan,Compte!$S$8:$S$52)))","v":""},{"$f":"IF($H44=\"\",\"\",IF(E44=\"\",\"\",LOOKUP(E44,Miniplan,Compte!$S$8:$S$52)))","v":""},null,null,null,null,null,null,""]
[null,null,null,"",null,"",null,null,{"$f":"IF($H45=\"\",\"\",IF(C45=\"\",\"\",LOOKUP(C45,Miniplan,Compte!$S$8:$S$52)))","v":""},{"$f":"IF($H45=\"\",\"\",IF(E45=\"\",\"\",LOOKUP(E45,Miniplan,Compte!$S$8:$S$52)))","v":""},null,null,null,null,null,null,""]
[null,null,null,"",null,"",null,null,{"$f":"IF($H46=\"\",\"\",IF(C46=\"\",\"\",LOOKUP(C46,Miniplan,Compte!$S$8:$S$52)))","v":""},{"$f":"IF($H46=\"\",\"\",IF(E46=\"\",\"\",LOOKUP(E46,Miniplan,Compte!$S$8:$S$52)))","v":""},null,null,null,null,null,null,""]
[null,null,null,"",null,"",null,null,{"$f":"IF($H47=\"\",\"\",IF(C47=\"\",\"\",LOOKUP(C47,Miniplan,Compte!$S$8:$S$52)))","v":""},{"$f":"IF($H47=\"\",\"\",IF(E47=\"\",\"\",LOOKUP(E47,Miniplan,Compte!$S$8:$S$52)))","v":""},null,null,null,null,null,null,""]
[null,null,null,"",null,"",null,null,{"$f":"IF($H48=\"\",\"\",IF(C48=\"\",\"\",LOOKUP(C48,Miniplan,Compte!$S$8:$S$52)))","v":""},{"$f":"IF($H48=\"\",\"\",IF(E48=\"\",\"\",LOOKUP(E48,Miniplan,Compte!$S$8:$S$52)))","v":""},null,null,null,null,null,null,""]
[null,null,null,"",null,"",null,null,{"$f":"IF($H49=\"\",\"\",IF(C49=\"\",\"\",LOOKUP(C49,Miniplan,Compte!$S$8:$S$52)))","v":""},{"$f":"IF($H49=\"\",\"\",IF(E49=\"\",\"\",LOOKUP(E49,Miniplan,Compte!$S$8:$S$52)))","v":""},null,null,null,null,null,null,""]
[null,null,null,"",null,"",null,null,{"$f":"IF($H50=\"\",\"\",IF(C50=\"\",\"\",LOOKUP(C50,Miniplan,Compte!$S$8:$S$52)))","v":""},{"$f":"IF($H50=\"\",\"\",IF(E50=\"\",\"\",LOOKUP(E50,Miniplan,Compte!$S$8:$S$52)))","v":""},null,null,null,null,null,null,""]
[null,null,null,"",null,"",null,null,{"$f":"IF($H51=\"\",\"\",IF(C51=\"\",\"\",LOOKUP(C51,Miniplan,Compte!$S$8:$S$52)))","v":""},{"$f":"IF($H51=\"\",\"\",IF(E51=\"\",\"\",LOOKUP(E51,Miniplan,Compte!$S$8:$S$52)))","v":""},null,null,null,null,null,null,""]
[null,null,null,"",null,"",null,null,{"$f":"IF($H52=\"\",\"\",IF(C52=\"\",\"\",LOOKUP(C52,Miniplan,Compte!$S$8:$S$52)))","v":""},{"$f":"IF($H52=\"\",\"\",IF(E52=\"\",\"\",LOOKUP(E52,Miniplan,Compte!$S$8:$S$52)))","v":""},null,null,null,null,null,null,""]
[null,null,null,"",null,"",null,null,{"$f":"IF($H53=\"\",\"\",IF(C53=\"\",\"\",LOOKUP(C53,Miniplan,Compte!$S$8:$S$52)))","v":""},{"$f":"IF($H53=\"\",\"\",IF(E53=\"\",\"\",LOOKUP(E53,Miniplan,Compte!$S$8:$S$52)))","v":""},null,null,null,null,null,null,""]
[null,null,null,"",null,"",null,null,{"$f":"IF($H54=\"\",\"\",IF(C54=\"\",\"\",LOOKUP(C54,Miniplan,Compte!$S$8:$S$52)))","v":""},{"$f":"IF($H54=\"\",\"\",IF(E54=\"\",\"\",LOOKUP(E54,Miniplan,Compte!$S$8:$S$52)))","v":""},null,null,null,null,null,null,""]
[null,null,null,"",null,"",null,null,{"$f":"IF($H55=\"\",\"\",IF(C55=\"\",\"\",LOOKUP(C55,Miniplan,Compte!$S$8:$S$52)))","v":""},{"$f":"IF($H55=\"\",\"\",IF(E55=\"\",\"\",LOOKUP(E55,Miniplan,Compte!$S$8:$S$52)))","v":""},null,null,null,null,null,null,""]
[null,null,null,"",null,"",null,null,{"$f":"IF($H56=\"\",\"\",IF(C56=\"\",\"\",LOOKUP(C56,Miniplan,Compte!$S$8:$S$52)))","v":""},{"$f":"IF($H56=\"\",\"\",IF(E56=\"\",\"\",LOOKUP(E56,Miniplan,Compte!$S$8:$S$52)))","v":""},null,null,null,null,null,null,""]
[null,null,null,"",null,"",null,null,{"$f":"IF($H57=\"\",\"\",IF(C57=\"\",\"\",LOOKUP(C57,Miniplan,Compte!$S$8:$S$52)))","v":""},{"$f":"IF($H57=\"\",\"\",IF(E57=\"\",\"\",LOOKUP(E57,Miniplan,Compte!$S$8:$S$52)))","v":""},null,null,null,null,null,null,""]
[null,null,null,"",null,"",null,null,{"$f":"IF($H58=\"\",\"\",IF(C58=\"\",\"\",LOOKUP(C58,Miniplan,Compte!$S$8:$S$52)))","v":""},{"$f":"IF($H58=\"\",\"\",IF(E58=\"\",\"\",LOOKUP(E58,Miniplan,Compte!$S$8:$S$52)))","v":""},null,null,null,null,null,null,""]
[null,null,null,"",null,"",null,null,{"$f":"IF($H59=\"\",\"\",IF(C59=\"\",\"\",LOOKUP(C59,Miniplan,Compte!$S$8:$S$52)))","v":""},{"$f":"IF($H59=\"\",\"\",IF(E59=\"\",\"\",LOOKUP(E59,Miniplan,Compte!$S$8:$S$52)))","v":""},null,null,null,null,null,null,""]
[null,null,null,"",null,"",null,null,{"$f":"IF($H60=\"\",\"\",IF(C60=\"\",\"\",LOOKUP(C60,Miniplan,Compte!$S$8:$S$52)))","v":""},{"$f":"IF($H60=\"\",\"\",IF(E60=\"\",\"\",LOOKUP(E60,Miniplan,Compte!$S$8:$S$52)))","v":""},null,null,null,null,null,null,""]
{"$rows_left_out":199}
{"sheet":"Compte","index":1,"n_rows":100,"n_cols":36,"rows_kept":100,"cut":false,"hidden":false,"merged":[[8,26,8,27],[8,32,8,33],[8,28,8,29],[8,34,8,35],[5,1,5,7],[6,11,7,16],[6,2,6,3],[6,4,6,5],[6,26,7,29],[6,32,7,35]]}
[7]
[]
[]
[]
[null,null,null,null,null,null,null,null,null,null,null,"1900-01-06",1,4,null,null,true]
[]
[null,null,null,null,null,null,null,null,null,null,null,{"$f":"VLOOKUP(M5,Plan,3)","v":"Caisse"},null,null,null,null,null,null,null,"Plan comptable",null,{"$f":"T7","v":"Plan comptable"},null,null,null,null,"Résultat",null,null,null,null,null,"Bilan"]
[null,null,null,null,null,null,null,null,{"$f":"IF($H8=\"\",\"\",LOOKUP(C8,$T$8:$T$26,$S$8:$S$26))","v":""},{"$f":"IF($H8=\"\",\"\",LOOKUP(E8,$T$8:$T$26,$S$8:$S$26))","v":""},null,null,null,null,null,null,null,null,1,1000,"Caisse",{"$f":"T8&\"  \"&U8","v":"1000  Caisse"}]
[null,null,null,null,null,null,null,null,"","",null," Date","C/partie","Libellé","Débit","Crédit","Solde D/C",null,{"$f":"S8+1","v":2},1010,"Poste",{"$f":"T9&\"  \"&U9","v":"1010  Poste"},null,null,null,null,"Charges",null,"Produits",null,null,null,"Actif",null,"Passif"]
[null,null,null,null,null,null,null,null,"","",null,null,null,null,null,null,null,null,{"$f":"S9+1","v":3},1020,"Banque A","1020  Banque A"]
[null,null,null,null,null,null,null,null,"","",null,null,null,null,null,null,null,null,4,1021,"Banque B","1021  Banque B"]
[null,null,null,null,null,null,null,null,"","",null,null,null,null,null,null,null,null,5,1060,"Titres","1060  Titres"]
[null,null,null,null,null,null,null,null,"","",null,null,null,null,null,null,null,null,6,1100,"Clients","1100  Clients"]
[null,null,null,null,null,null,null,null,"","",null,null,null,null,null,null,null,null,7,1172,"Impôt anticip.","1172  Impôt anticip."]
[null,null,null,null,null,null,null,null,"","",null,null,null,null,null,null,null,null,8,1200,"Stock","1200  Stock"]
[null,null,null,null,null,null,null,null,"","",null,null,null,null,null,null,null,null,9,1300,"Actif trans.","1300  Actif trans."]
[null,null,null,null,null,null,null,null,"","",null,null,null,null,null,null,null,null,10,1500,"Machines","1500  Machines"]
[null,null,null,null,null,null,null,null,"","",null,null,null,null,null,null,null,null,11,1510,"Mobilier","1510  Mobilier"]
[null,null,null,null,null,null,null,null,"","",null,null,null,null,null,null,null,null,12,1520,"Informatique","1520  Informatique"]
[null,null,null,null,null,null,null,null,"","",null,null,null,null,null,null,null,null,13,1530,"Véhicules","1530  Véhicules"]
[null,null,null,null,null,null,null,null,"","",null,null,null,null,null,null,null,null,14,1600,"Immeuble","1600  Immeuble"]
[null,null,null,null,null,null,null,null,"","",null,null,null,null,null,null,null,null,15,null,null,"  "]
[null,null,null,null,null,null,null,null,"","",null,null,null,null,null,null,null,null,16,2000,"Fournisseurs","2000  Fournisseurs"]
[null,null,null,null,null,null,null,null,"","",null,null,null,null,null,null,null,null,17,2010,"Autres dettes","2010  Autres dettes"]
[null,null,null,null,null,null,null,null,"","",null,null,null,null,null,null,null,null,18,2100,"AVS / LPP","2100  AVS / LPP"]
[null,null,null,null,null,null,null,null,"","",null,null,null,null,null,null,null,null,19,2300,"Passif trans.","2300  Passif trans."]
[null,null,null,null,null,null,null,null,"","",null,null,null,null,null,null,null,null,20,2440,"Hypothèque","2440  Hypothèque"]
[null,null,null,null,null,null,null,null,"","",null,null,null,null,null,null,null,null,21,2800,"Capital","2800  Capital"]
[null,null,null,null,null,null,null,null,"","",null,null,null,null,null,null,null,null,22,2890,"Privé","2890  Privé"]
[null,null,null,null,null,null,null,null,"","",null,null,null,null,null,null,null,null,23,2990,"Résultat","2990  Résultat"]
[null,null,null,null,null,null,null,null,"","",null,null,null,null,null,null,null,null,24,null,null,"  ",null,null,null,{"$f":"AB31-AD31","v":0},{"$f":"IF(AB31=0,\"\",\"Bénéfice\")","v":""},{"$f":"IF(AB10+AD10=0,0,IF(SUM(AB10:AB30)>SUM(AD10:AD30),0,SUM(AD10:AD30)-SUM(AB10:AB30)))","v":0},{"$f":"IF(AD31=0,\"\",\"Perte\")","v":""},{"$f":"IF(AB10+AD10=0,0,IF(SUM(AD10:AD30)>SUM(AB10:AB30),0,SUM(AB10:AB30)-SUM(AD10:AD30)))","v":0},null,{"$f":"AH31-AJ31","v":0},{"$f":"IF(AH31=0,\"\",\"Perte\")","v":""},{"$f":"IF(AH10+AJ10=0,0,IF(SUM(AH10:AH30)>SUM(AJ10:AJ30),0,SUM(AJ10:AJ30)-SUM(AH10:AH30)))","v":0},{"$f":"IF(AJ31=0,\"\",\"Bénéfice\")","v":""},{"$f":"IF(AH10+AJ10=0,0,IF(SUM(AJ10:AJ30)>SUM(AH10:AH30),0,SUM(AH10:AH30)-SUM(AJ10:AJ30)))","v":0}]
[null,null,null,null,null,null,null,null,"","",null,null,null,null,null,null,null,null,25,3200,"Ventes","3200  Ventes",null,null,null,null,null,{"$f":"IF(AB10+AD10=0,\"\",SUM(AB10:AB31))","v":""},null,{"$f":"IF(AB10+AD10=0,\"\",SUM(AD10:AD31))","v":""},null,null,null,{"$f":"IF(AH10+AJ10=0,\"\",SUM(AH10:AH31))","v":""},null,{"$f":"IF(AH10+AJ10=0,\"\",SUM(AJ10:AJ31))","v":""}]
[null,null,null,null,null,null,null,null,"","",null,null,null,null,null,null,null,null,26,3290,"Déd.s/ventes","3290  Déd.s/ventes"]
[null,null,null,null,null,null,null,null,"","",null,null,null,null,null,null,null,null,27,3295,"Pertes s/cré.","3295  Pertes s/cré."]
[null,null,null,null,null,null,null,null,"","",null,null,null,null,null,null,null,null,28,3400,"Honoraires","3400  Honoraires"]
[null,null,null,null,null,null,null,null,"","",null,null,null,null,null,null,null,null,29,3630,"Autres produits","3630  Autres produits"]
[null,null,null,null,null,null,null,null,"","",null,null,null,null,null,null,null,null,30,null,null,"  "]
[null,null,null,null,null,null,null,null,"","",null,null,null,null,null,null,null,null,31,4000,"Achats mat.","4000  Achats mat."]
[null,null,null,null,null,null,null,null,"","",null,null,null,null,null,null,null,null,32,4200,"Achats march.","4200  Achats march."]
[null,null,null,null,null,null,null,null,{"$f":"IF($H40=\"\",\"\",LOOKUP(C40,$T$8:$T$26,$S$8:$S$26))","v":""},{"$f":"IF($H40=\"\",\"\",LOOKUP(E40,$T$8:$T$26,$S$8:$S$26))","v":""},null,null,null,null,null,null,null,null,33,4270,"Frais achats","4270  Frais achats"]
[null,null,null,null,null,null,null,null,"","",null,null,null,null,null,null,null,null,34,4280,"Variat. stock","4280  Variat. stock"]
[null,null,null,null,null,null,null,null,"","",null,null,null,null,null,null,null,null,35,4290,"Déd.s/achats","4290  Déd.s/achats"]
[null,null,null,null,null,null,null,null,"","",null,null,null,null,null,null,null,null,36,null,null,"  "]
[null,null,null,null,null,null,null,null,"","",null,null,null,null,null,null,null,null,37,5000,"Salaires","5000  Salaires"]
[null,null,null,null,null,null,null,null,"","",null,null,null,null,null,null,null,null,38,5270,"Ch. Sociales","5270  Ch. Sociales"]
[null,null,null,null,null,null,null,null,"","",null,null,null,null,null,null,null,null,39,6000,"Loyer","6000  Loyer"]
[null,null,null,null,null,null,null,null,"","",null,null,null,null,null,null,null,null,40,6100,"Entretien","6100  Entretien"]
[null,null,null,null,null,null,null,null,"","",null,null,null,null,null,null,null,null,41,6200,"Frais véhic.","6200  Frais véhic."]
[null,null,null,null,null,null,null,null,"","",null,null,null,null,null,null,null,null,42,6280,"Frais livraison","6280  Frais livraison"]
[null,null,null,null,null,null,null,null,"","",null,null,null,null,null,null,null,null,43,6400,"Eau  - Elec.","6400  Eau  - Elec."]
[null,null,null,null,null,null,null,null,"","",null,null,null,null,null,null,null,null,44,6500,"Frais admin.","6500  Frais admin."]
[null,null,null,null,null,null,null,null,"","",null,null,null,null,null,null,null,null,45,6600,"Publicité","6600  Publicité"]
[null,null,null,null,null,null,null,null,"","",null,null,null,null,null,null,null,null,46,6700,"ACE",{"$f":"T53&\"  \"&U53","v":"6700  ACE"}]
[null,null,null,null,null,null,null,null,"","",null,null,null,null,null,null,null,null,47,6800,"Intérêts - frais","6800  Intérêts - frais"]
[null,null,null,null,null,null,null,null,"","",null,null,null,null,null,null,null,null,48,null,null,"  "]
[null,null,null,null,null,null,null,null,"","",null,null,null,null,null,null,null,null,49,7000,"Hors expl.","7000  Hors expl."]
[null,null,null,null,null,null,null,null,"","",null,null,null,null,null,null,null,null,50,7400,"Ch et Pr titres","7400  Ch et Pr titres"]
[null,null,null,null,null,null,null,null,"","",null,null,null,null,null,null,null,null,51,7500,"Ch et Pr imm.","7500  Ch et Pr imm."]
[null,null,null,null,null,null,null,null,"","",null,null,null,null,null,null,null,null,52,8000,"Prod. except.","8000  Prod. except."]
[null,null,null,null,null,null,null,null,"","",null,null,null,null,null,null,null,null,53,9000,"Résultat exp.","9000  Résultat exp."]
{"$rows_left_out":40}