{"text_format":"1","workbook":"xlsx","n_sheets":7,"sheets":["Accueil","Bureau Direction","Comptabilité","Information","Portefeuille","   Presse    ","L"],"not_rendered":{"charts":4,"images":47,"macros":1,"external_links":0,"defined_names":38,"comments":1,"pivot_tables":0},"unopened":[],"bounds":{"document_bytes":16777216,"sheet_cells":100000,"rows_first":2000,"rows_last":500,"rows_between":2000,"halvings":0,"cell_chars":16384,"cell_head_chars":4096},"cells_cut":0,"cells_raw":0,"read":"whole","date_system":"1900"}

{"sheet":"Accueil","index":0,"n_rows":41,"n_cols":34,"rows_kept":41,"cut":false,"hidden":false,"merged":[[13,7,14,12],[1,7,2,12],[3,7,5,12],[6,7,9,12],[10,7,12,12],[26,0,26,2],[39,4,39,7],[28,1,28,3],[17,9,18,12],[34,2,34,4],[35,7,35,8],[19,11,19,12],[20,11,20,12],[31,8,31,11],[34,9,34,11],[35,9,35,11],[27,10,29,10]]}
[]
[null,1,false,0,null,1,null,"Jeu de bourse"]
[null,null,2]
[null,null,null,null,null,null,null,"Vous pouvez exercer vos talents de financier sur ce programme de simulation boursière."]
[]
[]
{"$rows_left_out":36}
{"sheet":"Bureau Direction","index":1,"n_rows":97,"n_cols":91,"rows_kept":97,"cut":false,"hidden":false,"merged":[[26,80,26,81],[38,80,38,81],[19,80,21,80],[19,79,21,79],[13,57,14,57],[13,21,13,22],[28,25,28,28],[7,23,7,24],[9,24,9,25],[8,23,8,25],[7,19,7,21],[0,4,0,21],[3,16,3,18],[4,8,4,9],[4,10,4,11],[4,12,4,13],[36,3,36,4],[15,0,15,1],[10,24,10,25],[10,22,10,23],[11,3,11,4],[10,9,10,11],[12,9,12,11],[19,4,20,6],[19,7,20,9],[12,21,12,22],[0,22,0,23],[8,8,8,9],[8,10,8,11],[8,12,8,13],[8,14,8,15],[5,10,5,11],[5,12,5,13],[9,16,9,18],[7,10,7,11],[38,5,38,8],[36,5,36,8],[37,5,37,8],[15,17,15,18],[16,17,16,18],[17,17,17,18],[33,5,35,8],[17,7,17,9],[19,10,20,11],[15,13,15,16],[45,38,45,39],[14,21,14,22],[13,19,13,20],[14,19,14,20],[26,25,26,28],[15,21,15,22],[29,25,29,28],[17,21,17,22],[27,25,27,28],[27,33,27,34],[18,21,18,22],[17,19,17,20],[18,19,18,20],[1,8,1,9],[1,10,1,11],[1,12,1,13],[2,8,2,9],[2,10,2,11],[2,12,2,13],[2,14,2,15],[7,8,7,9],[5,16,5,18],[6,16,6,18],[3,8,3,9],[3,10,3,11],[3,12,3,13],[3,14,3,15],[7,12,7,13],[7,14,7,15],[2,16,2,18],[7,16,7,18],[4,14,4,15],[4,16,4,18],[6,8,6,9],[6,10,6,11],[5,8,5,9],[6,12,6,13],[1,19,1,21],[2,19,2,21],[3,19,3,21],[3,23,3,24],[1,14,1,15],[15,19,15,20],[1,16,1,18],[5,14,5,15],[9,19,9,21],[4,23,5,24],[4,19,4,21],[5,19,5,21],[6,19,6,21],[6,22,6,23],[3,22,5,22],[6,14,6,15],[8,19,8,21],[11,21,11,22],[9,22,9,23],[14,17,14,18],[12,13,12,16],[13,13,13,16],[18,13,18,16],[21,13,22,16],[20,14,20,16],[16,13,16,16],[17,13,17,16],[25,25,25,28],[18,17,18,18],[44,38,44,39],[8,16,8,18],[11,6,11,7],[12,3,12,8],[11,9,11,11],[18,8,18,9],[18,5,18,7],[13,9,13,11],[14,13,14,16],[11,13,11,16],[50,58,50,62],[24,13,24,16],[23,13,23,16],[12,17,12,18],[13,17,13,18],[16,21,16,22],[13,55,13,56],[10,31,13,31],[10,13,10,15],[26,31,26,34],[16,19,16,20],[11,19,11,20],[12,19,12,20],[11,17,11,18],[10,16,10,18],[43,40,43,53]]}
["SMI",{"$f":"VLOOKUP(8,Cote,AG2+2)","v":148.15},null,null,{"$f":"\"Portefeuille de  \"&VLOOKUP(AG3,Accueil!K20:M21,2)","v":"Portefeuille de  Julius"},null,null,null,null,null,null,null,null,null,null,null,null,null,null,null,null,null,{"$f":"\"No \"&AG3","v":"No 1"},null,null,null,null,null,null,null,null,32,33,34,35,36,37,38,39,40,41,42,43,44,45,46,47,48,49,50,51,52,53,54,55,56,57,58,59,60,61,62,63,64,65,66,67,68,69,70,71,72,73,74,74,75,76,77,78,79,80,{"$f":"\"\"","v":""}]
[null,null,null,"min.",null,null,null,null,"Inventraire",null,"Acheté",null,"Vendu",null,"Prix moyen",null,"Valeur  ",null,null,"Situation",null,null,null,null,null,null,null,null,null,null,null,"Mois",1,null,null,null,"choix cote B/D",{"$f":"IF(AJ4=4,2,IF(AJ29=\"put\",2,1))","v":1},{"$f":"IF(AJ4=4,2,IF(AJ29=\"put\",2,1))","v":1},"Constantes mensuelles. Nom : Datamens",null,null,null,null,null,null,null,null,null,null,null,null,null,null,null,null,null,null,null,null,null,null,null,null,null,null,null,null,null,null,null,null,null,null,null,null,null,null,null,null,null,{"$f":"\"\"","v":""}]
[null,null,null,{"$f":"ROUNDUP((1000/R13),0)","v":63},{"$f":"AL11","v":"Abeco"},null,null,null,{"$f":"IF($AG$3=1,BB23,BB35)","v":0},null,{"$f":"IF($AG$3=1,BC23,BC35)","v":0},null,{"$f":"IF($AG$3=1,BD23,BD35)","v":0},null,{"$f":"IF($AG$3=1,IF(I3=0,\"\",BT23),IF(I3=0,\"\",BT35))","v":""},null,{"$f":"IF($AG$3=1,BU23,BU35)","v":0},null,null,{"$f":"IF($AG$3=1,CA23,CA35)","v":0},null,null,null,null,null,null,null,null,null,null,null,"Joueur",1,{"$f":"IF(AG3=1,\"A actif\",\"B actif\")","v":"A actif"},"Voir com:",0,"Coef. Cote",{"$f":"IF(AG4<6,1,IF(AJ4=2,0.75,1))","v":1},null,null,1,2,3,4,5,6,7,8,9,10,11,12,13,14,null,null,null,null,"Pour le graphique : variation en %",null,null,null,null,null,null,null,null,null,null,null,null,null,null,null,"Tableau pour information. En vert le warrant serait exercé en mode américain",null,null,null,null,null,null,null,null,null,null,null,null,null,"31 déc.",null,"strick"]
[null,null,null,{"$f":"ROUNDUP((1000/R14),0)","v":1},"Bell & Cie",null,null,null,{"$f":"IF($AG$3=1,BB24,BB36)","v":0},null,{"$f":"IF($AG$3=1,BC24,BC36)","v":0},null,{"$f":"IF($AG$3=1,BD24,BD36)","v":0},null,{"$f":"IF($AG$3=1,IF(I4=0,\"\",BT24),IF(I4=0,\"\",BT36))","v":""},null,{"$f":"IF($AG$3=1,BU24,BU36)","v":0},null,null,{"$f":"IF($AG$3=1,CA24,CA36)","v":0},null,null,{"$f":"IF(AG2<13,\"Résultat virtuel des titres\",\"Résultat final des titres\")","v":"Résultat virtuel des titres"},{"$f":"HLOOKUP(AG2,Datamens,2)","v":"janvier"},null,null,{"$f":"IF(X5=31,\"Fin de partie\",\"\")","v":""},null,{"$f":"IF($AG$3=1,IF(AO$30=1,\"o\",\"\"),IF(AO$42=1,\"o\",\"\"))","v":""},null,null,"Titre choisi",{"$f":"AH4-1","v":0},1,null,{"$f":"IF(AG6=FALSE,AG5,AG5+2)","v":1},"légende :","achat",1,null,"janvier","février","mars","avril","mai","juin","juillet","août","septembre","octobre","novembre","décembre","décembre","FIN",null,null,null,null,null,"déc","jan","fév","mars","avril","mai","juin","juillet","août","sep","oct","nov","déc",null,null,"Bell","cours",{"$f":"AN$12","v":2330},2354,2401,2378,2615,2544,2568,2734,2758,2710,2568,2710,2829,null,"call"]
[null,null,null,{"$f":"ROUNDUP((1000/R15),0)","v":7},"Comon",null,null,null,0,null,0,null,0,null,"",null,{"$f":"IF($AG$3=1,BU25,BU37)","v":0},null,null,0,null,null,null,{"$f":"HLOOKUP(AG2,Datamens,3)","v":1},null,null,null,null,{"$f":"IF($AG$3=1,IF(AP$30=1,\"o\",\"\"),IF(AP$42=1,\"o\",\"\"))","v":""},null,null,"Achat/Vente",1,"Put:","Call :","Pr cote :","Ecran","vente",2,null,1,1,1,1,1,1,1,1,1,1,1,1,31,null,null,null,null,null,"Abeco",{"$f":"AN11*100/AN11","v":100},{"$f":"IF(BH$13=0,BH5,AO11*100/$AN11)","v":100},{"$f":"IF(BI$13=0,BI5,AP11*100/$AN11)","v":100},100,100,100,100,100,100,100,100,100,100,null,null,null,"équart",{"$f":"BY4-$CM$5","v":-270},{"$f":"BZ4-$CM$5","v":-246},-199,-222,15,-56,-32,134,158,110,-32,110,229,null,{"$f":"(ROUNDUP(BB12/100,0)*100)","v":2600}]
[null,null,null,{"$f":"ROUNDUP((1000/R16),0)","v":2},"Divogan",null,null,null,0,null,0,null,0,null,"",null,{"$f":"IF($AG$3=1,BU26,BU38)","v":0},null,null,0,null,null,null,null,null,null,null,null,{"$f":"IF($AG$3=1,IF(AQ$30=1,\"o\",\"\"),IF(AQ$42=1,\"o\",\"\"))","v":""},null,null,"Option",false,0,{"$f":"IF(AG6=FALSE,0,IF(AG5=1,1,0))","v":0},{"$f":"IF(AG4<6,AH6,IF(AJ4=4,1,AH6))","v":0},{"$f":"IF(AI6=1,\"call\",\"put\")","v":"put"},"Call",3,null,null,null,null,null,null,null,null,null,null,null,null,null,null,null,null,null,null,null,"Bell & Cie",{"$f":"AN12*100/AN12","v":100},{"$f":"IF(BH$13=0,BH6,AO12*100/$AN12)","v":101.03004291845494},{"$f":"IF(BI$13=0,BI6,AP12*100/$AN12)","v":101.03004291845494},101.03004291845494,101.03004291845494,101.03004291845494,101.03004291845494,101.03004291845494,101.03004291845494,101.03004291845494,101.03004291845494,101.03004291845494,101.03004291845494,null,null,"Divo","cours",{"$f":"AN$14","v":580},591,569,597,603,574,540,523,574,540,529,534,529,null,{"$f":"(ROUNDUP(BB14/100,0)*100)+20","v":620}]
{"$rows_left_out":92}
{"sheet":"Comptabilité","index":2,"n_rows":64,"n_cols":37,"rows_kept":64,"cut":false,"hidden":false,"merged":[[1,34,1,35],[3,3,3,10],[3,11,3,15],[5,0,5,1],[7,0,7,1],[6,0,6,1],[58,11,59,14],[5,2,5,15],[50,11,50,14],[52,8,52,9],[53,8,53,9],[50,8,50,9],[51,8,51,9],[58,4,59,7],[58,8,59,9],[58,10,59,10],[51,11,51,14],[52,11,52,14],[53,11,53,14],[8,0,8,1],[9,0,9,1],[14,19,14,26],[16,15,17,15],[16,10,17,14],[10,2,10,15],[11,0,11,1],[10,0,10,1],[45,0,45,1],[45,11,45,14],[46,11,46,14],[49,11,49,14],[47,8,47,9],[48,8,48,9],[49,8,49,9],[45,8,45,9],[46,8,46,9],[55,8,55,9],[55,4,55,7],[47,4,47,7],[48,4,48,7],[49,4,49,7],[50,4,50,7],[51,4,51,7],[52,4,52,7],[44,11,44,14],[54,11,54,14],[43,4,43,7],[44,4,44,7],[45,4,45,7],[46,4,46,7],[54,8,54,9],[21,24,21,25],[22,24,22,25],[23,24,23,25],[22,21,22,23],[21,19,21,23],[23,19,23,23],[42,3,42,14],[47,11,47,14],[48,11,48,14],[57,4,57,7],[56,8,56,9],[55,11,55,14],[43,8,43,9],[44,8,44,9],[56,11,56,14],[56,4,56,7],[56,3,57,3],[57,8,57,9],[53,4,53,7],[54,4,54,7],[57,11,57,14],[43,11,43,14]]}
[{"$f":"'Bureau Direction'!AG2","v":1},{"$f":"'Bureau Direction'!AG3","v":1},null,null,null,null,null,null,null,null,null,null,null,null,null,null,null,null,null,null,null,null,null,null,null,null,null,null,null,null,null,32,33,34,35,36,37]
[null,null,null,null,null,null,null,null,null,null,null,{"$f":"VLOOKUP(AJ4,Accueil!K20:M21,2)","v":"Julius"},null,null,null,null,null,null,null,null,null,null,null,null,null,null,"zoom",88,null,null,null,"Mois pour le titre",null,null,"Variable GLOB"]
[null,null,null,null,null,null,null,null,null,null,null,null,null,null,null,null,null,null,null,null,null,null,null,null,null,null,null,null,null,null,null,1,"janvier",{"$f":"IF($AJ$3<AF3,\"\",AG3)","v":"janvier"},"Actif mois /firm",{"$f":"A1","v":1},{"$f":"B1","v":1}]
[null,null,null,"Les compte \"Titres\"  de   ",null,null,null,null,null,null,null,{"$f":"VLOOKUP(AJ5,AF3:AG15,2)","v":"janvier"},null,null,null,null,null,null,null,null,null,null,null,null,null,null,null,null,null,null,null,2,"février",{"$f":"IF($AJ$3<AF4,\"\",AG4)","v":""},"Firm compta",1]
[null,null,null,null,null,null,null,null,null,null,null,null,null,null,null,null,null,null,null,null,null,null,null,null,null,null,null,null,null,null,null,3,"mars",{"$f":"IF($AJ$3<AF5,\"\",AG5)","v":""},"Mois compta",1]
["Situation Titres",null,"TITRES",null,null,null,null,null,null,null,null,null,null,null,null,null,null,null,null,null,null,null,null,null,null,null,null,null,null,null,null,4,"avril","","Achats"]
{"$rows_left_out":59}
{"sheet":"Information","index":3,"n_rows":42,"n_cols":19,"rows_kept":42,"cut":false,"hidden":false,"merged":[[2,14,3,16],[4,14,9,16],[32,8,33,11],[34,8,34,11],[11,10,11,11],[5,0,5,1],[5,6,6,7],[11,6,11,7],[5,2,6,2],[5,3,6,4],[7,10,7,11],[8,10,8,11],[28,7,28,8],[37,8,37,11],[38,8,38,11],[13,6,13,7],[36,8,36,11],[35,8,35,11],[19,2,20,4],[9,10,9,11],[40,8,40,11],[41,8,41,11],[10,14,10,16],[39,8,39,11]]}
[null,null,null,null,null,null,null,null,null,null,null,null,null,null,null,null,null,null,1]
[]
[null,null,null,null,null,null,null,null,null,null,null,null,null,null,"Warrants"]
[]
[null,null,null,null,null,null,null,null,null,null,null,null,null,null,"Les Calls (droit d'acheter) et les Puts (droit de vendre) peuvent être achetés en activant la case \"option\". Ils peuvent être vendus en bourse comme de simples actions pour le 75% de la prime."]
[null,null,"Titres","Nominal",null,null,"Dividendes distribués l'année précédente"]
{"$rows_left_out":37}
{"sheet":"Portefeuille","index":4,"n_rows":37,"n_cols":36,"rows_kept":37,"cut":false,"hidden":false,"merged":[[36,23,36,26],[36,27,36,30],[1,33,1,34],[3,19,3,22],[3,23,3,26],[3,27,3,30],[2,28,2,30],[21,19,21,22],[21,23,21,26],[21,27,21,30],[17,32,17,33],[16,32,16,33],[34,32,34,33],[35,32,35,33],[18,23,18,26],[0,4,0,5],[0,25,0,29],[1,25,1,29],[0,7,1,23],[1,4,1,5],[18,27,18,30],[2,3,2,6],[20,3,20,6],[21,15,21,18],[3,15,3,18],[21,3,21,6],[21,7,21,10],[21,11,21,14],[3,3,3,6],[3,7,3,10],[3,11,3,14]]}
[null,null,null,null,"Légende :",null,null,"Portefeuille détaillé",null,null,null,null,null,null,null,null,null,null,null,null,null,null,null,null,null,{"$f":"D3","v":"Julius"},null,null,null,null,true]
[null,null,null,null,"Achats Ventes",null,null,null,null,null,null,null,null,null,null,null,null,null,null,null,null,null,null,null,null,{"$f":"D21","v":"Baer"},null,75,null,null,false,null,null,"zoom",null,95]
[null,null,null,{"$f":"Accueil!L20","v":"Julius"},null,null,null,null,null,null,null,null,null,null,null,null,null,null,null,null,null,null,null,null,null,null,null,null,"Ajustement colonnes"]
[null,null,null,"Abeco",null,null,null,"Bell & Cie",null,null,null,"Comon",null,null,null,"Divogan",null,null,null,"Ob. Emotion",null,null,null,"Warrant BELL",null,null,null,"Warrant DIVO"]
[]
[null,null,"Janvier",{"$f":"'Bureau Direction'!$AO$23","v":0},{"$f":"IF(D6=0,\"\",\"x\")","v":""},{"$f":"IF(D6=0,0,'Bureau Direction'!$AO$11)","v":0},{"$f":"D6*F6*-1","v":0},{"$f":"'Bureau Direction'!$AO$24","v":0},{"$f":"IF(H6=0,\"\",\"x\")","v":""},{"$f":"IF(H6=0,0,'Bureau Direction'!$AO$12)","v":0},{"$f":"H6*J6*-1","v":0},{"$f":"'Bureau Direction'!$AO$25","v":0},{"$f":"IF(L6=0,\"\",\"x\")","v":""},{"$f":"IF(L6=0,0,'Bureau Direction'!$AO$13)","v":0},{"$f":"L6*N6*-1","v":0},{"$f":"'Bureau Direction'!$AO$26","v":0},{"$f":"IF(P6=0,\"\",\"x\")","v":""},{"$f":"IF(P6=0,0,'Bureau Direction'!$AO$14)","v":0},{"$f":"P6*R6*-1","v":0},{"$f":"'Bureau Direction'!$AO$27","v":0},{"$f":"IF(T6=0,\"\",\"x\")","v":""},{"$f":"IF(T6=0,0,'Bureau Direction'!$AO$15)","v":0},{"$f":"T6*V6*-1","v":0},{"$f":"'Bureau Direction'!$AO$28","v":0},{"$f":"IF(X6=0,\"\",\"x\")","v":""},{"$f":"IF(X6=0,0,'Bureau Direction'!$AO$88)","v":0},{"$f":"X6*Z6*-1","v":0},{"$f":"'Bureau Direction'!$AO$29","v":0},{"$f":"IF(AB6=0,\"\",\"x\")","v":""},{"$f":"IF(AB6=0,0,'Bureau Direction'!$AO$89)","v":0},{"$f":"AB6*AD6*-1","v":0},null,{"$f":"'Bureau Direction'!N13","v":"Abeco"},{"$f":"'Bureau Direction'!R13","v":16}]
{"$rows_left_out":32}
{"sheet":"   Presse    ","index":5,"n_rows":58,"n_cols":37,"rows_kept":58,"cut":false,"hidden":false,"merged":[[29,9,29,10],[26,2,26,6],[7,2,8,4],[9,2,9,4],[7,6,16,6],[10,2,22,2],[10,4,22,4]]}
[null,null,null,null,null,null,null,null,null,null,null,null,null,null,"Entreprise no",{"$f":"'Bureau Direction'!AF9","v":"Emprunt"},"Nom :",{"$f":"VLOOKUP(P1,'Bureau Direction'!AJ23:AN27,2)","v":0},"Nb Employés",{"$f":"'Bureau Direction'!L4","v":0},null,null,null,null,"Faillite :",{"$f":"VLOOKUP(P1,Datavar,16)","v":{"$error":"#NAME?"}}]
[null,null,"  ",null,null,null,null,null,"Sommaire",null,null,null,null,null,"Commentaire no",1,4,null,null,null,null,null,null,null,{"$f":"'Bureau Direction'!H16","v":0},null,null,null,null,null,null,null,null,null,"Journal, groupement des lignes"]
[null,null," ",null,null,null,null,null,null,null,null,null,null,null,"Articles","1. Présentation","2. La bourse","3. Les actions","4. Les obligations","5. Les futures","6. Les options","7. Les warrant","8. Les ventes à découvert","9. La tendance","10. Stratégie"]
[null,null,null,null,null,null,null,null,null,null,null,null,null,null,"largeur 21 svp",1,2,3,4,5,6,7,8,9,10]
[null,null," ",null,null,null,null,null,null,null,null,null,null,null,0,"SMAK-MARKET","LA BOURSE","Les actions","Les obligations","Les futures","Les options","Les warrants","VAD - Ventes à découvert","La tendance","Stratégie",1]
[null,null,null,null,0,null,null,null,null,null,null,null,null,null,1,"Un jeu de bourse","Confrontation entre l'offre et la demande","Des titres de propriété","Des titres de créance","Contrats d'achat ou de vente à terme","Achat ou vente d'un droit","Une forme d'option à succès.","Outils pour spéculer à la baisse","Des indices pour nous guider","Comment se protéger dans une VAD ?"," "]
{"$rows_left_out":53}
{"sheet":"L","index":6,"n_rows":369,"n_cols":4,"rows_kept":369,"cut":false,"hidden":false,"merged":[[0,0,0,3],[2,2,2,3]]}
["Vocabulaire économique et boursier"]
[]
[]
["A",null,"à vue","Immédiatement à la présentation d'un papier-valeur"]
[null,null,"acceptation","Signature du tiré sur un effet de change par laquelle il s'engage à payer le montant indiqué."]
[null,null,"accroche","Titre d'un texte publicitaire souvent mis en valeur graphiquement. (Headline)"]
{"$rows_left_out":363}